{"text_format":"1","workbook":"xlsx","n_sheets":25,"sheets":["Veiledning","Prosjektbeskrivelse og inndata","Beregningsfaktorer","Transport og energibehov","Utslippsfaktorer","Resultat","Sensitivitetsanalyse","Beregninger","Drift og vedlikehold","Hovedvei","Sidevei","Anleggsvei","Tillegg vei","Tunnel enkeltløp","Tunnel dobbeltløp","Betongbru","Stålbru","Kulvert","Vegetasjon og arealbeslag","Sprengning","Reasfaltering","Beregningsfaktorer arbeidsfane","Utslippsfaktorer arbeidsfane","Revisjonslogg","Revisjonslogg_intern"],"not_rendered":{"charts":14,"images":3,"macros":1,"external_links":0,"defined_names":41,"comments":0,"pivot_tables":0},"unopened":[],"bounds":{"document_bytes":16777216,"sheet_cells":100000,"rows_first":2000,"rows_last":500,"rows_between":2000,"halvings":0,"cell_chars":16384,"cell_head_chars":4096},"cells_cut":0,"cells_raw":0,"read":"whole","date_system":"1900"}

{"sheet":"Veiledning","index":0,"n_rows":78,"n_cols":9,"rows_kept":78,"cut":false,"hidden":false,"merged":[[50,1,56,20],[1,1,4,3],[65,4,65,10],[27,1,29,20],[37,1,39,20],[41,1,43,20],[45,1,48,20],[58,1,60,20],[13,1,23,18],[34,1,35,20],[31,1,32,20]]}
[]
[null,"NV-GHG",null,null,"Versjon 2.2"]
[null,null,null,null,"Oppdatert 21.09.2020"]
[null,null,null,null,null,null,null,"Dette regnskapet er utarbeidet av:"]
[null,null,null,null,null,null,null,"Navn:","Ragnhild Stamer Ekerholt"]
[null,null,null,null,null,null,null,"Firma:","NIRAS Norge AS"]
[null,null,null,null,null,null,null,"Stilling:","Bærekraftsrådgiver"]
[null,null,null,null,null,null,null,"E-post:","raek@niras.com"]
[null,null,null,null,null,null,null,"Telefon: ",92872660]
[null,null,null,null,null,null,null,"Kvalitetssikrer: ","Julie Gade Gørbitz"]
[]
[]
[null,"Introduksjon"]
[null,"NV-GHG er et verktøy for å beregne klimagassutslipp fra veiprosjekter i en tidlig fase. Verktøyet er utviklet av NIRAS Norge AS for Nye Veier AS. \n\nVerktøyet har tre hovedformål:\n- Baseline (beregne baseline for nye prosjekter på det tidspunktet strekningen tildeles Nye Veier)\n- Budsjett (klimagassbudsjett for planlagt bygget løsning - for enkelte strekninger vil dette påkreves av entreprenør)\n- Resultat (beregning av klimagassutslipp fra ferdig bygget løsning - for enkelte strekninger vil dette påkreves av entreprenør)\n\nVerktøyet er ment å gi en god oversikt over de viktigste kildene til prosjektets totale klimagassutslipp, samt formidle utslippsdrivende prosesser og aktiviteter på en tydelig måte, slik at tiltak kan iverksettes der potensialet for utslippsreduksjoner er størst. Det er lagt stor vekt på at verktøyet skal være brukervennlig, både for byggherre, rådgiver og entreprenør. Det er derfor kun nødvendig å fylle inn data i fanen 'Prosjektbeskrivelse og inndata'. Dersom brukeren av verktøyet ønsker å legge inn prosjektspesifikke verdier ut over dette, kan dette gjøres i fanene 'Transport og energibehov', 'Beregningsfaktorer' og 'Utslippsfaktorer'. Alle faner der det er mulig å gjøre endringer har grønn farge. Blå faner inneholder resultater. "]
[]
[]
[]
[]
[]
[]
[]
[]
[]
[]
[]
[null,"De ulike fanene"]
[null,"Prosjektbeskrivelse og inndata"]
[null,"Her legges det inn informasjon om lengder, arealer og mengder for å kunne beregne klimagassutslipp i prosjektet. Verktøyet vil kunne estimere klimagassutslipp basert på informasjonen i denne fanen alene. I tabellen 'Om strekningen' legges det inn overordnet informasjon om strekningen som kreves for å kunne beregne samlede mengder. I tabellen 'Arealbruksendringer' fylles det inn prosentvis fordeling mellom de ulike arealtypene som beslaglegges i prosjektet. Summen av disse skal være 100 %. I tabellen 'Inndata' legges det inn mer detaljert informasjon om ulike konstruksjoner, massehåndtering, veityper, osv. Enheter velges fra nedtrekksmenyen."]
[]
[]
[null,"Resultat"]
[null,"Resultatene er fremstilt i tabeller og grafisk i resultatfanen. Tallene hentes fra beregningsfanen."]
[]
[null,"Sensitivitetsanalyse"]
[null,"Sensitivitetsanalysen viser hvilke utslag en prosentvis endring i én eller flere innsatsfaktorer vil gi på totale utslipp. Sensitivitetsanalysen gir dermed et bilde på hvilke tiltak og endringer som vil ha størst effekt på det totale klimagassutslippet, både negativt og positivt. "]
[]
[null,"Beregninger"]
[null,"Beregningsfanen samler all informasjon fra 'Prosjektbeskrivelse og inndata' og de ulike enhets- og faktorfanene. Her multipliseres mengder og aktiviteter med utslippsfaktorene slik at vi sitter igjen med klimagassutslipp knyttet til de ulike hoved- og underaktivitetene. Beregningsfanen skiller mellom byggefase og drift, slik at det fremkommer tydelig hvilke utslipp som er knyttet til byggeperioden (år 0) og hvilke som er knyttet til drift og vedlikehold gjennom hele analyseperioden. Verdier fra beregningsfanen benyttes videre i resultatfanen."]
[]
[]
[null,"13 enhetsfaner for følgende kategorier: Hovedvei, Sidevei, Anleggsvei, Tunnel enkeltløp, Tunnel dobbeltløp, Betongbru, Stålbru, Kulvert,  Vegetasjon og arealbeslag, Sprengning, Tillegg vei, Drift og vedlikehold, Reasfaltering"]
[null,"Enhetsfanene bygger på informasjon fra beregningsfaktorfanene for å beregne mengder og energiforbruk for en gitt skalerbar enhet. For eksempel tar tunnelfanene utgangspunkt i valgt tunnelprofil for å beregne mengder og energibruk per meter, mens veifanene beregner per kvadratmeter slik at disse endres dynamisk med endret veibredde. Enhetsfanene inkluderer materialer, transportavstander og anleggsarbeid. Verdier fra enhetsfanene benyttes videre i beregningsfanen."]
[]
[]
[null,"Transport og energibehov"]
[null,"Fanen samler alle beregningsfaktorer knyttet til transport, slik som arbeidshastigheter for ulike maskiner, transportavstander og energiforbruk. Alle faktorer kan tilpasses prosjektet ved å legge inn prosjektspesifikke verdier - husk å legge inn dokumentasjon i kolonnen 'Dokumentasjon prosjektspesifikke verdier'! Beregningene leser alltid verdier fra kolonnen 'Verdi benyttet i beregninger', som er linket opp mot kolonnen for standardverdi og prosjektspesifikk verdi. Standardverdiene hentes dersom cellen for prosjektspesifikke verdier står tom. Dersom det legges inn en prosjektspesifikk verdi vil denne overstyre standardverdien. Det er i tillegg mulig å skille mellom ulike brensler ved å endre prosentandeler på henholdsvis fossil diesel, biodiesel og elektrisk/hydrogen for de ulike maskintypene. Merk at effektforbruk må fylles inn dersom det benyttes elektriske maskiner."]
[]
[]
[]
[null,"Utslippsfaktorer"]
[null,"Fanen gir en oversik over alle utslippsfaktorer benyttet i prosjektet. Utslippsfaktorfanen blir brukt av beregningsfanen, der faktorene multipliseres med mengder for å gi et samlet resultat, fremstilt i resultatfanen. Alle standard utslippsfaktorer er ment å representere bransjestandard for hvert materiale, men på grunn av ulike produksjonsmetoder og -steder vil dette variere mellom produsenter og materialer innenfor samme materialgruppe. Faktorene kan derfor tilpasses prosjektet ved å legge inn prosjektspesifikke verdier - husk å legge inn dokumentasjon i kolonnen 'Dokumentasjon prosjektspesifikke verdier'! Vær oppmerksom på enheten til utslippsfaktorene ved bruk av prosjektspesifikke verdier. Dersom enheten til en utslippsfaktorer er i kg CO2e/kg og du ønsker å benytte en utslippsfaktor med enhet kg CO2e/m3, må denne omregnes til kg CO2/kg vha. massetettheten til det gitte materialet (se i beregningsfaktorfanen). Formel for omgjøring er som følger: Utslippsfaktor [kg CO2e/kg] = utslippsfaktor [kg CO2e/m3] / massetetthet [kg/m3].\n\nBeregningene leser alltid verdier fra kolonnen 'Verdi benyttet i beregninger', som er linket opp mot kolonnen for standardverdi og prosjektspesifikk verdi. Standardverdiene hentes dersom cellen for prosjektspesifikke verdier står tom. Dersom det legges inn prosjektspesifikk verdi vil denne overskrive standardverdien. Dersom det benyttes prosjektspesifikke utslippsfaktorer skal disse dokumenteres med en gyldig EPD."]
[]
[]
[]
[]
[]
[]
[null,"Beregningsfaktorer"]
[null,"Fanen samler alle beregningsfaktorer som ikke er knyttet til transport, slik som massetettheter, materialtykkelser, levetider, osv. Alle faktorer kan tilpasses prosjektet ved å legge inn prosjektspesifikke verdier - husk å legge inn dokumentasjon i kolonnen 'Dokumentasjon prosjektspesifikke verdier'! Beregningene leser alltid verdier fra kolonnen 'Verdi benyttet i beregninger', som er linket opp mot kolonnen for standardverdi og prosjektspesifikk verdi. Standardverdiene hentes dersom cellen for prosjektspesifikke verdier står tom. Dersom det legges inn prosjektspesifikk verdi vil denne overskrive standardverdien."]
[]
[]
[]
[null,"Enheter"]
[null,"Følgende enheter benyttes i regneverktøyet:"]
[]
[null,"Forkortelse","Betydning","Kategori","Kommentar"]
[null,"km","Kilometer","Avstand"]
[null,"m","Meter","Avstand"]
[null,"h","Time","Tid"]
[null,"t","Tonn","Vekt"]
[null,"kg","Kilogram","Vekt"]
[null,"tkm","Tonnkilometer","Transportarbeid","Én tonnkilometer tilsvarer å frakte ett tonn last én kilometer"]
[null,"L","Liter","Volum"]
[null,"m3","Kubikkmeter","Volum"]
[null,"m2","Kvadratmeter","Areal"]
[null,"kWh","Kilowattimer","Energi","Elektrisk energi"]
[null,"kW","Kilowatt","Effekt","Elektrisk effekt"]
[null,"stk","Stykk","Mengde"]

{"sheet":"Prosjektbeskrivelse og inndata","index":1,"n_rows":51,"n_cols":23,"rows_kept":51,"cut":false,"hidden":false,"merged":[[19,1,19,2],[4,3,4,5],[13,3,13,5],[14,3,14,5],[5,3,5,5],[6,3,6,5],[7,3,7,5],[8,3,8,5],[16,3,16,5],[17,3,17,5],[1,9,1,13],[2,3,2,5],[2,6,2,7],[3,3,3,5],[15,3,15,5],[9,3,9,5],[10,3,10,5],[11,3,11,5],[12,3,12,5]]}
[]
[null,"Om strekningen",null,null,null,null,null,null,null,"Inndata"]
[null,"Prosjektinformasjon","Mengde","Beskrivelse",null,null,"Kommentar",null,null,"Kalkylepost \n(fra anslagsrapport)","Beskrivelse","Mengde","Definert enhet \n(velges fra nedtrekksmeny)","Kommentar"]
[null,"Lengde hovedstrekning [m]",{"$f":"F35","v":4744.3999999999996},"Summen av hovedvei, tunnel og bru",null,null,null,null,null,"Forberedende tiltak og generelle kostnader"]
[null,"Gjennomsnittlig bredde på anleggsbelte [m]",{"$f":"L24/(L23+L22+L5)","v":39.636363636363633},"Til beregning av vegetasjonsrydding",null,null,null,null,null,13,"Anleggsveier",200,"Anleggsvei (m)"]
[null,"Antall enkeltløpstunneler",0,"Til beregning av tunnelportaler"]
[null,"Antall dobbeltløpstunneler",0,"Til beregning av tunnelportaler",null,null,null,null,null,"Sprengning og masseflytting"]
[null,"Antall kulverter",3,"Til beregning av anleggsarbeid ",null,null,null,null,null,22,"Sprengning i dagen",165000,"Sprengning i dagen (m3)"]
[null,"Gjennomsnittsbredde hovedvei",7.5,null,null,null,null,null,null,25,"Masseflytting av jord",70000,"Jordmasser til linja (m3)"]
[null,"Gjennomsnittsbredde sidevei",4.5,null,null,null,null,null,null,25,"Masseflytting av jord",30000,"Jordmasser til deponi (m3)"]
[null,"Gjennomsnittsbredde anleggsvei",6.5,null,null,null,null,null,null,26,"Masseflytting av sprengt stein",125000,"Sprengstein til linja (m3)"]
[null,"Gjennomsnittsbredde betongbruer",8.5,null,null,null,null,null,null,26,"Masseflytting av sprengt stein",45000,"Sprengstein til linja (m3)"]
[null,"Gjennomsnittsbredde stålbruer"]
[null,"Analyseperiode [år]",60,"Standard 60 år",null,null,null,null,null,"Konstruksjon"]
[null,"ÅDT",3850,"Gjennomsnittlig ÅDT, opprinnelig",null,null,"Hentet fra SVVs \"Vegkart\"",null,null,null,"Hammeren",29.4,"Betongbru (m)","Dimensjoner (LxB) = 29,4 x 8,5 m = 249,9 m2"]
[null,"Delta ÅDT",null,"Endring i ÅDT fra opprinnelig strekning",null,null,null,null,null,null,"Dalandsbekken",15,"Betongbru (m)","Dimensjoner (LxB) = 15 x 8,5 m = 139,4 m2"]
[null,"Belysning hovedvei","Ja","Er hovedvei belyst",null,null,null,null,null,null,"Kulvert ca pr.1680",90,"Betongkulvert (m2)","GS-kulvert med lengde 30 m"]
[null,"Belysning sidevei","Ja","Er sidevei belyst",null,null,null,null,null,null,"Kulvert ca pr.2970",60,"Betongkulvert (m2)","GS-kulvert med lengde 20 m"]
[null,null,null,null,null,null,null,null,null,null,"Kulvert ca pr.3470",75,"Betongkulvert (m2)","GS-kulvert med lengde 25 m"]
[null,"Arealbruksendringer"]
[null,"Totalt arealbeslag [m2]",{"$f":"E35*C5","v":186290.90909090909},null,null,null,null,null,null,"Annet"]
[null,null,null,null,null,null,null,null,null,null,"Hovedvei (Fv. 416)",4700,"Hovedvei (m)"]
[null,"Naturtype","Andel [%]","Kommentar",null,null,null,null,null,null,"Sidevei",600,"Sidevei (m)"]
[null,"Skog - lav bonitet",null,null,null,null,null,null,null,null,"Arealbeslag",218000,"Fjerning av vegetasjonsdekke (m2)"]
[null,"Skog - middels bonitet",0.5]
[null,"Skog - høy bonitet"]
[null,"Myr"]
[null,"Jordbruksareal",0.1]
[null,"Utbygd areal",0.4]
[null,"Sum",{"$f":"SUM(C24:C29)","v":1},"Må være 100 %!",null,null,null,null,null,null,null,null,null,null,null,null,null,null,null,null,null,"Fjerning av vegetasjonsdekke (m2)","m2"]
[null,"Dersom boniteten er ukjent skal skogarealer føres på 'middels bonitet'",null,null,null,null,null,null,null,null,null,null,null,null,null,null,null,null,null,null,null,"Sprengning i dagen (m3)","m3"]
[null,null,null,null,null,null,null,null,null,null,null,null,null,null,null,null,null,null,null,null,null,"Sprengning tunnel (m3)","m3"]
[null,"Prosentfordeling mellom tunnel, bru og vei i dagen på hovedstrekning",null,null,null,null,null,null,null,null,null,null,null,null,null,null,null,null,null,null,null,"Jordmasser til linja (m3)","m3"]
[null,null,"Tunnel","Bru","Vei i dagen","Totalt",null,null,null,null,null,null,null,null,null,null,null,null,null,null,null,"Jordmasser til deponi (m3)","m3"]
[null,"Lengde [m]",0,{"$f":"L15+L16","v":44.4},{"$f":"L22","v":4700},{"$f":"C35+D35+E35","v":4744.3999999999996},null,null,null,null,null,null,null,null,null,null,null,null,null,null,null,"Sprengstein til linja (m3)","m3"]
[null,"Andel [%]",{"$f":"IFERROR(C35/C4,0)","v":0},{"$f":"IFERROR(D35/C4,0)","v":9.3584014838546496E-3},{"$f":"IFERROR(E35/(C4),0)","v":0.99064159851614542},{"$f":"C36+D36+E36","v":1},null,null,null,null,null,null,null,null,null,null,null,null,null,null,null,"Sprengstein til deponi (m3)","m3"]
[null,null,null,null,null,null,null,null,null,null,null,null,null,null,null,null,null,null,null,null,null,"Sprengstein til linja via pukkverk (m3)","m3"]
[null,null,null,null,null,null,null,null,null,null,null,null,null,null,null,null,null,null,null,null,null,"Hovedvei (m)","m"]
[null,null,null,null,null,null,null,null,null,null,null,null,null,null,null,null,null,null,null,null,null,"Sidevei (m)","m"]
[null,null,null,null,null,null,null,null,null,null,null,null,null,null,null,null,null,null,null,null,null,"Anleggsvei (m)","m"]
[null,null,null,null,null,null,null,null,null,null,null,null,null,null,null,null,null,null,null,null,null,"Betongbru (m)","m2"]
[null,null,null,null,null,null,null,null,null,null,null,null,null,null,null,null,null,null,null,null,null,"Stålbru (m)","m2"]
[null,null,null,null,null,null,null,null,null,null,null,null,null,null,null,null,null,null,null,null,null,"Tunnel enkeltløp (m)","m"]
[null,null,null,null,null,null,null,null,null,null,null,null,null,null,null,null,null,null,null,null,null,"Tunnel dobbeltløp (m)","m"]
[null,null,null,null,null,null,null,null,null,null,null,null,null,null,null,null,null,null,null,null,null,"Betongkulvert (m2)","m2"]
[]
[]
[]
[null,null,null,null,null,null,null,null,null,null,null,null,null,null,null,null,null,null,null,null,null,"Belysning valg"]
[null,null,null,null,null,null,null,null,null,null,null,null,null,null,null,null,null,null,null,null,null,"Ja"]
[null,null,null,null,null,null,null,null,null,null,null,null,null,null,null,null,null,null,null,null,null,"Nei"]

{"sheet":"Beregningsfaktorer","index":2,"n_rows":89,"n_cols":19,"rows_kept":89,"cut":false,"hidden":false,"merged":[[39,13,39,14],[39,15,39,16],[39,17,39,18]]}
[]
[null,"Størrelse ","Enhet","Verdi benyttet i beregninger","Standard-verdi","Prosjekt-spesifikk verdi","Kommentar","Dokumentasjon standardverdi","Evt. lenke dokumentasjon standardverdi","Dokumentasjon prosjektspesifikk verdi","Evt. lenke dokumentasjon prosjektsesifikk verdi"]
[null,"Massetettheter"]
[null,"Betong ","kg/m3",{"$f":"IF(F4=\"\",E4,F4)","v":2400},2400,null,null,"Norsk betongforening Publikasjon 37: Lavkarbonbetong (2015)"]
[null,"Stål, armeringsstål ","kg/m3",7850,7850,null,null,"\"Metode for beregning av energiforbruk og klimagassutslipp for vegprosjekter\", Hammervold (2009) s. 8, Engineering Toolbox"," https://www.engineeringtoolbox.com/metal-alloys-densities-d_50.html "]
[null,"Skjelettasfalt","kg/m3",2500,2500,null,null,"\"Metode for beregning av energiforbruk og klimagassutslipp for vegprosjekter\", Hammervold (2009) s. 34"]
[null,"Asfaltgrusbetong ","kg/m3",2500,2500,null,null,"\"Metode for beregning av energiforbruk og klimagassutslipp for vegprosjekter\", Hammervold (2009) s. 34"]
[null,"Asfaltgrus ","kg/m3",2400,2400,null,null,"Klimamodul EFFEKT 6.74"]
[null,"Pukk/grus frostsikring ","kg/m3",1550,1550,null,null,"Anbefalt verdi i samkjøringsprosjekt, snitt av minimums- og maksimumsverdi (1,4-1,7) i EPDer"]
[null,"Pukk/grus forsterkningslag ","kg/m3",1550,1550,null,null,"Anbefalt verdi i samkjøringsprosjekt, snitt av minimums- og maksimumsverdi (1,4-1,7) i EPDer"]
[null,"XPS ","kg/m3",35,35,null,null,"VegLCA (kommunikasjon med leverandører)"]
[null,"XPS-/betongelement til frostsikring i tunnel ","kg/m3",1808.75,1808.75,null,null,"EPD XPS-/betongelement Ølen betong"]
[null,"Topeka ","kg/m3",2500,2500,null,null,"\"Metode for beregning av energiforbruk og klimagassutslipp for vegprosjekter\", Hammervold (2009) s. 34, bruker samme som asfaltbetong"]
[null,"Jord, grus, leire fra vegetasjonsrydding","kg/m3",1300,1300,null,null,"\"Metode for beregning av energiforbruk og klimagassutslipp for vegprosjekter\", Hammervold (2009) s. 32"]
[null,"Myr fra vegetasjonsrydding","kg/m3",150,150,null,null,"Utredning myr, Hadsel kommune (Asplan Viak, 2017)"]
[null,"Fast fjell","kg/m3",2650,2650,null,null,"\"Metode for beregning av energiforbruk og klimagassutslipp for vegprosjekter\", Hammervold (2009) s. 32"]
[null,"Masser fra grøfterensk","kg/m3",1300,1300,null,null,"\"Metode for beregning av energiforbruk og klimagassutslipp for vegprosjekter\", Hammervold (2009) s. 32, antar samme type masser som fra vegetasjonsrydding"]
[null,"Materialtykkelser/-mengder"]
[null,"Slitelag tykkelse","m",{"$f":"IF(F19=\"\",E19,F19)","v":4.4999999999999998E-2},4.4999999999999998E-2,null,null,"Statens Vegvesen håndbok N200 "]
[null,"Bindlag tykkelse","m",{"$f":"IF(F20=\"\",E20,F20)","v":3.5000000000000003E-2},3.5000000000000003E-2,null,null,"Statens Vegvesen håndbok N200 "]
[null,"Bærelag tykkelse","m",0.13,0.13,null,null,"Statens Vegvesen håndbok N200"]
[null,"Forsterkningslag tykkelse","m",0.45,0.45,null,null,"Statens Vegvesen håndbok N200"]
[null,"Frostsikringslag vei tykkelse","m",1.74,1.74,null,null,"Statens Vegvesen håndbok N200"]
[null,"Topeka tykkelse","m",1.2E-2,1.2E-2,null,null,"Statens Vegvesen håndbok R762"]
[null,"Frostsikringselement tunnel tykkelse","m",0.2,0.2,null,null,"EPD XPS-/betongelement Ølen betong"]
[null,"Betongtykkelse til betongbru","m",{"$f":"IF(F26=\"\",E26,F26)","v":1.29},1.29,null,null,"\"Metode for beregning av energiforbruk og klimagassutslipp for vegprosjekter\", Hammervold (2009) s. 47, gjennomsnitt for samtlige betongbruer, ikke vektet etter areal av bru"]
[null,"Betongtykkelse til stålbru","m",{"$f":"IF(F27=\"\",E27,F27)","v":0.74299999999999999},0.74299999999999999,null,null,"\"Metode for beregning av energiforbruk og klimagassutslipp for vegprosjekter\", Hammervold (2009) s. 47, gjennomsnitt for samtlige stålbruer, ikke vektet etter areal av bru"]
[null,"Armeringsstål til betongbru","kg/m2",{"$f":"IF(F28=\"\",E28,F28)","v":231},231,null,null,"\"Metode for beregning av energiforbruk og klimagassutslipp for vegprosjekter\", Hammervold (2009) s. 47, gjennomsnitt for samtlige betongbruer, ikke vektet etter areal av bru"]
[null,"Armeringsstål til stålbru","kg/m2",125,125,null,null,"\"Metode for beregning av energiforbruk og klimagassutslipp for vegprosjekter\", Hammervold (2009) s. 47, gjennomsnitt for samtlige stålbruer, ikke vektet etter areal av bru"]
[null,"Konstruksjonsstål til betongbru","kg/m2",0,0,null,null,"\"Metode for beregning av energiforbruk og klimagassutslipp for vegprosjekter\", Hammervold (2009) s. 47, gjennomsnitt for samtlige betongbruer, ikke vektet etter areal av bru"]
[null,"Konstruksjonsstål til stålbru","kg/m2",219,219,null,null,"\"Metode for beregning av energiforbruk og klimagassutslipp for vegprosjekter\", Hammervold (2009) s. 47, gjennomsnitt for samtlige stålbruer, ikke vektet etter areal av bru"]
[null,"Sikringsbolter til tunnel","kg/m",44,44,null,null,"\"Metode for beregning av energiforbruk og klimagassutslipp for vegprosjekter\", Hammervold (2009) s. 8 i vedlegg 1"]
[null,"Sprengstoff til sprengning i dagen","kg/fm3",1,1,null,"EFFEKT og Metoderapport oppgir ikke kilden de har brukt, og verdien bør derfor sokumenteres bedre i samtlige verktøy","\"Metode for beregning av energiforbruk og klimagassutslipp for vegprosjekter\", Hammervold (2009) og dokumentasjon EFFEKT 2015 (SVV Rapport 358)"]
[null,"Sprengstoff til sprengning tunnel","kg/fm3",2.2000000000000002,2.2000000000000002,null,"EFFEKT og Metoderapport oppgir ikke kilden de har brukt, og verdien bør derfor sokumenteres bedre i samtlige verktøy","\"Metode for beregning av energiforbruk og klimagassutslipp for vegprosjekter\", Hammervold (2009) og dokumentasjon EFFEKT 2015 (SVV Rapport 358)"]
[null,"Kulverter"]
[null,"Betongtykkelse kulvertelementer","m",{"$f":"IF(F36=\"\",E36,F36)","v":0.24},0.24,null,null,"Prefabrikkerte kulvertelementer, Statens vegvesen","https://www.vegvesen.no/fag/teknologi/bruer/bruprosjektering/prefabrikkerte-kulvertelementer/_attachment/1361322?_ts=15d081de438&fast_title=Grunnlag%2C+beregningsforutsetninger+og+eksempel.pdf"]
[null,"Høyde på kulverter","m",{"$f":"IF(F37=\"\",E37,F37)","v":3.2},3.2,null,null,"Prefabrikkerte kulvertelementer, Statens vegvesen","https://www.vegvesen.no/fag/teknologi/bruer/bruprosjektering/prefabrikkerte-kulvertelementer/_attachment/1361322?_ts=15d081de438&fast_title=Grunnlag%2C+beregningsforutsetninger+og+eksempel.pdf"]
[null,"Forholdstall mellom betong og armering","kg/kg",13,13,null,null,"Tar utgangspunkt i \"Metode for beregning av energiforbruk og klimagassutslipp for vegprosjekter\", Hammervold (2009), s. 8 i Vedlegg 1, der andelen betong er 13 ganger høyere enn andelen armering for samme volum."]
[null,"Arbeidshastighet tårnkran","h/stk",{"$f":"IF(F39=\"\",E39,F39)","v":18},18,null,null,"NIRAS' erfaringstall"]
[null,"Tunneler",null,null,null,null,null,null,null,null,null,null,"Tunnelprofil","Teoretisk sprengningsprofil",null,"Normalprofil",null,"Veibredder"]
[null,"Tunnelprofil enkeltløp","-",{"$f":"IF(F41=\"\",E41,F41)","v":10.5},10.5,null,null,"Typisk tunnelprofil",null,null,null,null,null,"Areal \n[m2]","Buelengde \n[m]","Areal \n[m2]","Buelengde \n[m]","Kjørebane\n[m]","Skulder\n[m]"]
[null,"Tunnelprofil dobbeltløp","-",{"$f":"IF(F42=\"\",E42,F42)","v":9.5},9.5,null,null,"Typisk tunnelprofil",null,null,null,null,4,20.32,12.13,13.57,9.85,3,1]
[null,"Betongmengde per portal enkeltløp","m3/stk",357.61406844106466,{"$f":"VLOOKUP(D41,M42:O52,3,FALSE)/O46*340","v":357.61406844106466},null,null,"\"Metode for beregning av energiforbruk og klimagassutslipp for vegprosjekter\", Hammervold (2009), s. 8 i Vedlegg 1. ",null,null,null,null,5.5,39.1,17.12,29.72,14.55,3.5,2]
[null,"Betongmengde per portal dobbeltløp","m3/stk",340,{"$f":"VLOOKUP(D42,M42:O52,3,FALSE)/O46*340","v":340},null,null,"\"Metode for beregning av energiforbruk og klimagassutslipp for vegprosjekter\", Hammervold (2009), s. 8 i Vedlegg 1. ",null,null,null,null,7.5,51.56,18.88,40.46,16.3,5,2.5]
[null,"Armering per portal enkeltløp","kg/stk",65211.977186311786,{"$f":"VLOOKUP(D41,M42:O52,3,FALSE)/O46*62000","v":65211.977186311786},null,null,"\"Metode for beregning av energiforbruk og klimagassutslipp for vegprosjekter\", Hammervold (2009), s. 8 i Vedlegg 1. ",null,null,null,null,8.5,61.92,20.56,49.66,17.989999999999998,6.5,2]
[null,"Armering per portal dobbeltløp","kg/stk",62000,{"$f":"VLOOKUP(D42,M42:O52,3,FALSE)/O46*62000","v":62000},null,null,"Metode for beregning av energiforbruk og klimagassutslipp for vegprosjekter, Hammervold (2009), s. 8 i Vedlegg 1. ",null,null,null,null,9.5,66.62,21.04,53.61,18.46,7,2.5]
[null,"Andel under sjø for enkeltløpstunnel","%",{"$f":"IF(F47=\"\",E47,F47)","v":0},0,null,"For beregning av strømforbruk vifter og pumper","-",null,null,null,null,10.5,74.59,22.13,60.64,19.55,8,2.5]
[null,"Andel under sjø for dobbeltløpstunnel","%",{"$f":"IF(F48=\"\",E48,F48)","v":0},0,null,"For beregning av strømforbruk vifter og pumper","-",null,null,null,null,11.5,85.92,23.75,70.89,21.18,9.5,2]
[null,"Drift- og vedlikeholdsintervaller",null,null,null,null,null,null,null,null,null,null,12.5,91.32,24.32,75.489999999999995,21.73,10,2.5]
[null,"Utskiftningsintervall reasfaltering","år",{"$f":"IF(F50=\"\",E50,F50)","v":7},7,null,null,"NIRAS' erfaringstall",null,null,null,null,13,95.69,24.86,79.39,22.28,10.5,2.5]
[null,"Utskiftningsintervall autovern","år",30,30,null,null,"Håndbok N101 Rekkverk\nog vegens sideområder (2014) s. 63",null,null,null,null,13.5,100.52,25.46,83.73,22.88,11,2.5]
[null,"Utskiftningsintervall lyktestolper","år",30,30,null,null,"Håndbok V124 (2014) tabell 4.5 s. 51",null,null,null,null,14,104.58,25.96,87.35,23.88,11.5,2.5]
[null,"Driftsintervall kantklipp","år",1,1,null,null,"NIRAS' erfaringstall. "]
[null,"Driftsintervall grøfterensk","år",3,3,null,null,"NIRAS' erfaringstall. "]
[null,"Driftsintervall feiing","år",1,1,null,null,"NIRAS' erfaringstall. "]
[null,"Driftsintervall salting","år",1,1,null,null,"NIRAS' erfaringstall. "]
[null,"Driftsintervall brøyting","år",1,1,null,null,"NIRAS' erfaringstall. "]
[null,"Reasfaltering, drift og vedlikehold"]
[null,"Andel til reasfaltering","%",{"$f":"IF(F59=\"\",E59,F59)","v":0.6},0.6,null,null,"NIRAS' erfaringstall"]
[null,"Elforbruk belysning i dagen","kWh/(stk*år)",{"$f":"IF(F60=\"\",E60,F60)","v":1600},1600,null,null,"Samkjøringsprosjekt. Basert på Håndbok V124 - teknisk planlegging av veg- og tunnelbelysning. Forbruk: 400 W, 4100 brenntimer/år. Konservativt, mest representativt for høy ÅDT. "]
[null,"Elforbruk belysning i tunnel","kWh/(lm*år)",{"$f":"IF(F61=\"\",E61,F61)","v":34},34,null,null,"Antar likt som for vei i dagen basert på at det er det som gjøres i \"Metode for beregning av energiforbruk og klimagassutslipp for vegprosjekter\", Hammervold (2009) og dokumentasjon for EFFEKT 6.6"]
[null,"Elforbruk viftedrift oversjøisk enkeltløpstunnel","kWh/(ÅDT*km*år)",{"$f":"IF(F62=\"\",E62,F62)","v":3.7},3.7,null,"Bruker samme formel som tunnel dobbeltløp","\"Metode for beregning av energiforbruk og klimagassutslipp for vegprosjekter\", Hammervold (2009) s. 46"]
[null,"Elforbruk viftedrift undersjøisk enkeltløpstunnel","kWh/(ÅDT*km*år)",14.6,14.6,null,"Bruker samme formel som tunnel dobbeltløp","\"Metode for beregning av energiforbruk og klimagassutslipp for vegprosjekter\", Hammervold (2009) s. 46"]
[null,"Elforbruk viftedrift oversjøisk dobbeltløpstunnel","kWh/(ÅDT*km*år)",3.7,3.7,null,null,"\"Metode for beregning av energiforbruk og klimagassutslipp for vegprosjekter\", Hammervold (2009) s. 46"]
[null,"Elforbruk viftedrift undersjøisk dobbeltløpstunnel","kWh/(ÅDT*km*år)",14.6,14.6,null,null,"\"Metode for beregning av energiforbruk og klimagassutslipp for vegprosjekter\", Hammervold (2009) s. 46"]
[null,"Elforbruk pumpedrift oversjøisk tunnel","kWh/(m*år)",0,0,null,"Per tunnelløp","\"Metode for beregning av energiforbruk og klimagassutslipp for vegprosjekter\", Hammervold (2009) s. 45/46"]
[null,"Elforbruk pumpedrift undersjøisk tunnel","kWh/(m*år)",18,18,null,"Per tunnelløp","\"Metode for beregning av energiforbruk og klimagassutslipp for vegprosjekter\", Hammervold (2009) s. 45/46"]
[null,"Saltforbruk","tonn/(km*år)",{"$f":"IF(F68=\"\",E68,F68)","v":10.5},10.5,null,null,"Mengderapportering vinteren 2018/2019, SVV rapport 362. Landsgjennomsnitt for riksvei"]
[null,"Km brøyting per km vei per år","km/(km*år)",{"$f":"IF(F69=\"\",E69,F69)","v":724.7},724.7,null,null,"Mengderapportering vinteren 2018/2019, SVV rapport 362. Landsgjennomsnitt for riksvei"]
[null,"Km salting per km vei per år for tofelt","km/(km*år)",{"$f":"IF(F70=\"\",E70,F70)","v":100},100,null,"Salter to felt per tur","NIRAS' erfaringstall. "]
[null,"Renset volum ved grøfterensk","m3/m",{"$f":"IF(F71=\"\",E71,F71)","v":0.13300000000000001},0.13300000000000001,null,null,"NIRAS' erfaringstall. "]
[null,"Annet"]
[null,"Lyktestolper inkludert fundament","kg/stk",{"$f":"IF(F73=\"\",E73,F73)","v":227},227,null,null,"Produsentinformasjon fra Vik Ørsta AS. Produktkatalog 2020 s. 17 og s. 44 "]
[null,"Antall lyktestolper per belysningsrekke per km hovedvei","stk/km",{"$f":"IF('Prosjektbeskrivelse og inndata'!C17=\"Nei\",0,IF(F74=\"\",E74,F74))","v":21.25},21.25,null,null,"Kilde belysningsklasse: Håndbok V124 (2014) tabell 3.2, s. 25. Kilde historisk effektforbruk: Håndbok 264 (2008) tabell 7.1 s. 66"]
[null,"Antall lyktestolper per belysningsrekke per km sidevei","stk/km",{"$f":"IF('Prosjektbeskrivelse og inndata'!C18=\"Nei\",0,IF(F75=\"\",E75,F75))","v":21.25},21.25,null,null,"Kilde belysningsklasse: Håndbok V124 (2014) tabell 3.2, s. 25. Kilde historisk effektforbruk: Håndbok 264 (2008) tabell 7.1 s. 66"]
[null,"Autovern","kg/m",{"$f":"IF(F76=\"\",E76,F76)","v":16.5},16.5,null,"Stålet har krav til fasthet, men gjenvinningsgrad og leverandør kan variere da de handler inn stål i bulk på et stort stålmarked. Ikke noe \"finere\" kvalitet på stålet til rekkverk enn stålet på autovern. For firefeltsvei må rekkverkmengden ganges med 4. ","Forutsetter styrkeklasse H1 ihht. tabell 3.1 og rundskriv om rekkverk 110 km/t. Forenkler til å beregne med samme rekkverkstandard på bruer. Tar utgangspunkt i Vik Ørsta W3 siderekkverk, med vekt 12,5 kg/m + 16 kg per stolpe. jf telefonsamtale representant Ørsta Vik desember 2016. Rekkverket Vik EP H1 CC4 har stolpeavstand på 4 m -> Samlet vekt blir 12,5 + 16/4 = 16,5 kg/m. "]
[null,"Antall kjørefelt enkeltløpstunnel","stk",2,2,null,null,"NIRAS' erfaringstall. "]
[null,"Antall kjørefelt dobbeltløpstunnel","stk",4,4,null,null,"NIRAS' erfaringstall. "]
[null,"Antall kjørefelt hovedvei","stk",4,4,null,null,"NIRAS' erfaringstall. "]
[null,"Antall kjørefelt sidevei","stk",2,2,null,null,"NIRAS' erfaringstall. "]
[null,"Antall belysningsrekker hovedvei","stk",2,2,null,null,"NIRAS' erfaringstall. "]
[null,"Antall belysningsrekker sidevei","stk",1,1,null,null,"NIRAS' erfaringstall. "]
[null,"Antall autovern hovedvei","stk",4,4,null,null,"NIRAS' erfaringstall. "]
[null,"Antall autovern sidevei","stk",2,2,null,null,"NIRAS' erfaringstall. "]
[null,"Antall grøfter hovedvei","stk",3,3,null,null,"NIRAS' erfaringstall. "]
[null,"Antall grøfter sidevei","stk",2,2,null,null,"NIRAS' erfaringstall. "]
[null,"Antall veimerkinger hovedvei","stk",5,5,null,null,"NIRAS' erfaringstall. "]
[null,"Antall veimerkinger sidevei","stk",3,3,null,null,"NIRAS' erfaringstall. "]
[null,"Tykkelse på vegetasjonslag som fjernes","m",0.3,0.3,null,null,"NIRAS' erfaringstall. "]

{"sheet":"Transport og energibehov","index":3,"n_rows":57,"n_cols":18,"rows_kept":57,"cut":false,"hidden":false,"merged":[[15,10,15,13],[22,10,22,13],[29,10,29,13],[3,14,13,14],[15,2,15,5],[15,6,15,9],[22,2,22,5],[22,6,22,9],[29,2,29,5],[29,6,29,9]]}
[]
[null,"Størrelse","Enhet","Verdi benyttet \ni beregninger","Standardverdi","Prosjekt-spesifikk \nverdi","Enhet","Verdi benyttet \ni beregninger","Standardverdi","Prosjekt-spesifikk \nverdi","Enhet","Andel \nel/\nhydrogen","Andel \nbiodiesel","Andel \ndiesel","Kommentar","Dokumentasjon standardverdi","Dokumentasjon prosjektspesifikke verdier","Evt. lenke for dokumentasjon"]
[null,"Transportavstand materialer [tur/retur]"]
[null,"Transport i linja","km",{"$f":"IF(F4=\"\",E4,F4)","v":0.5},1,0.5,null,null,null,null,null,null,null,null,"Disse verdiene er meget generelle og det anbefales å benytte prosjektspesifikke verdier så langt det er mulig","Estimert basert på erfaringstall","Inndata fra Stian Blindheim, mottatt den 22.10.20"]
[null,"Transport til deponi/lager","km",{"$f":"IF(F5=\"\",E5,F5)","v":5},15,5,null,null,null,null,null,null,null,null,null,"Estimert basert på erfaringstall"]
[null,"Transport til pukkverk","km",15,15,null,null,null,null,null,null,null,null,null,null,"Estimert basert på erfaringstall"]
[null,"Asfaltbetong (Agb)","km",30,30,null,null,null,null,null,null,null,null,null,null,"Estimert basert på erfaringstall"]
[null,"Asfaltert grus (Ag)","km",30,30,null,null,null,null,null,null,null,null,null,null,"Estimert basert på erfaringstall"]
[null,"Kult til frost- og forsterkningslag","km",15,15,null,null,null,null,null,null,null,null,null,null,"Estimert basert på erfaringstall"]
[null,"Betong","km",40,40,null,null,null,null,null,null,null,null,null,null,"Estimert basert på erfaringstall"]
[null,"Stål","km",400,400,null,null,null,null,null,null,null,null,null,null,"Estimert basert på erfaringstall"]
[null,"Armeringsstål","km",400,400,null,null,null,null,null,null,null,null,null,null,"Estimert basert på erfaringstall"]
[null,"Fuktsikring bru (Topeka)","km",70,70,null,null,null,null,null,null,null,null,null,null,"Estimert basert på erfaringstall"]
[null,"Frostsikringselementer tunnel","km",70,70,null,null,null,null,null,null,null,null,null,null,"Estimert basert på erfaringstall"]
[null,"Salt","km",500,500,null,null,null,null,null,null,null,null,null,null,"Samme verdi som VegLCA. Løselig basert på typiske land for import av salt. SaltImportøren importerer hovedsakelig fra Europa og Middelhavsområdet, CG Rieber fra Tyskland, Nederland og Israel og Mesta fra blant annet Tunisia, Italia, Danmark og Marokko.",null,"SaltImport: https://produktguiden.veier24.no/products/62-saltimport-asCG Rieber: https://www.gcrieber-salt.no/markeder/veivedlikehold/ Mesta: https://www.miljoklagenemnda.no/assets/files/Sak_2014_2_mesta.pdf"]
[null,"Energiforbruk og -kilder massetransport","Diesel  (liter pr. km /lastens størrelse i tonn)",null,null,null,"Elektrisitet (kWh pr. km /lastens størrelse i tonn)",null,null,null,"Fordeling mellom brensler"]
[null,"Massetransport i linja","L/tkm",{"$f":"IF(F17=\"\",E17,F17)","v":0.02},0.02,null,"kWh/tkm",{"$f":"IF(J17=\"\",0,J17)","v":0},"Ingen standardverdi",null,"%",0,7.0000000000000007E-2,{"$f":"1-L17-M17","v":0.92999999999999994},"Forutsatt lastekapasitet 30 tonn og forbruk 0,6 L/km. Dersom ikke annet er oppgitt, benytt fordelingen 93 % fossil diesel, 7 % biodiesel","NIRAS' erfaringstall. "]
[null,"Massetransport til deponi/lager","L/tkm",{"$f":"IF(F18=\"\",E18,F18)","v":0.02},0.02,null,"kWh/tkm",{"$f":"IF(J18=\"\",0,J18)","v":0},"Ingen standardverdi",null,"%",0,7.0000000000000007E-2,{"$f":"1-L18-M18","v":0.92999999999999994},"Forutsatt lastekapasitet 30 tonn og forbruk 0,6 L/km. Dersom ikke annet er oppgitt, benytt fordelingen 93 % fossil diesel, 7 % biodiesel","NIRAS' erfaringstall. "]
[null,"Massetransport til pukkverk","L/tkm",0.02,0.02,null,"kWh/tkm",0,"Ingen standardverdi",null,"%",0,7.0000000000000007E-2,0.92999999999999994,"Forutsatt lastekapasitet 30 tonn og forbruk 0,6 L/km. Dersom ikke annet er oppgitt, benytt fordelingen 93 % fossil diesel, 7 % biodiesel","NIRAS' erfaringstall. "]
[null,"Asfaltbetong (Agb)","L/tkm",0.02,0.02,null,"kWh/tkm",0,"Ingen standardverdi",null,"%",0,7.0000000000000007E-2,0.92999999999999994,"Forutsatt lastekapasitet 30 tonn og forbruk 0,6 L/km. Dersom ikke annet er oppgitt, benytt fordelingen 93 % fossil diesel, 7 % biodiesel","NIRAS' erfaringstall. "]
[null,"Asfaltert grus (Ag)","L/tkm",{"$f":"IF(F21=\"\",E21,F21)","v":0.02},0.02,null,"kWh/tkm",0,"Ingen standardverdi",null,"%",0,7.0000000000000007E-2,0.92999999999999994,"Forutsatt lastekapasitet 30 tonn og forbruk 0,6 L/km. Dersom ikke annet er oppgitt, benytt fordelingen 93 % fossil diesel, 7 % biodiesel","NIRAS' erfaringstall. "]
[null,"Kult til frost- og forsterkningslag","L/tkm",0.02,0.02,null,"kWh/tkm",{"$f":"IF(J22=\"\",0,J22)","v":0},"Ingen standardverdi",null,"%",0,7.0000000000000007E-2,0.92999999999999994,"Forutsatt lastekapasitet 30 tonn og forbruk 0,6 L/km. Dersom ikke annet er oppgitt, benytt fordelingen 93 % fossil diesel, 7 % biodiesel","NIRAS' erfaringstall. "]
[null,"Energiforbruk og -kilder materialtransport","Diesel (liter pr. km /lastens størrelse i tonn)",null,null,null,"Elektrisitet (kWh pr. km /lastens størrelse i tonn)",null,null,null,"Fordeling mellom brensler"]
[null,"Betong","L/tkm",{"$f":"IF(F24=\"\",E24,F24)","v":0.02},0.02,null,"kWh/tkm",{"$f":"IF(J24=\"\",0,J24)","v":0},"Ingen standardverdi",null,"%",0,7.0000000000000007E-2,0.92999999999999994,"Forutsatt lastekapasitet 30 tonn og forbruk 0,6 L/km. Dersom ikke annet er oppgitt, benytt fordelingen 93 % fossil diesel, 7 % biodiesel","NIRAS' erfaringstall. "]
[null,"Stål","L/tkm",{"$f":"IF(F25=\"\",E25,F25)","v":0.02},0.02,null,"kWh/tkm",{"$f":"IF(J25=\"\",0,J25)","v":0},"Ingen standardverdi",null,"%",0,7.0000000000000007E-2,0.92999999999999994,"Forutsatt lastekapasitet 30 tonn og forbruk 0,6 L/km. Dersom ikke annet er oppgitt, benytt fordelingen 93 % fossil diesel, 7 % biodiesel","NIRAS' erfaringstall. "]
[null,"Armeringsstål","L/tkm",{"$f":"IF(F26=\"\",E26,F26)","v":0.02},0.02,null,"kWh/tkm",0,"Ingen standardverdi",null,"%",0,7.0000000000000007E-2,0.92999999999999994,"Forutsatt lastekapasitet 30 tonn og forbruk 0,6 L/km. Dersom ikke annet er oppgitt, benytt fordelingen 93 % fossil diesel, 7 % biodiesel","NIRAS' erfaringstall. "]
[null,"Topeka","L/tkm",{"$f":"IF(F27=\"\",E27,F27)","v":0.02},0.02,null,"kWh/tkm",0,"Ingen standardverdi",null,"%",0,7.0000000000000007E-2,0.92999999999999994,"Forutsatt lastekapasitet 30 tonn og forbruk 0,6 L/km. Dersom ikke annet er oppgitt, benytt fordelingen 93 % fossil diesel, 7 % biodiesel","NIRAS' erfaringstall. "]
[null,"Frostsikringselementer tunnel","L/tkm",0.02,0.02,null,"kWh/tkm",0,"Ingen standardverdi",null,"%",0,7.0000000000000007E-2,0.92999999999999994,"Forutsatt lastekapasitet 30 tonn og forbruk 0,6 L/km. Dersom ikke annet er oppgitt, benytt fordelingen 93 % fossil diesel, 7 % biodiesel","NIRAS' erfaringstall. "]
[null,"Transport av andre masser/materialer med lastebil","L/tkm",0.02,{"$f":"0.6/30","v":0.02},null,"kWh/tkm",{"$f":"IF(J29=\"\",0,J29)","v":0},"Ingen standardverdi",null,"%",0,7.0000000000000007E-2,{"$f":"1-L29-M29","v":0.92999999999999994},"Forutsatt lastekapasitet 30 tonn og forbruk 0,6 L/km. Dersom ikke annet er oppgitt, benytt fordelingen 93 % fossil diesel, 7 % biodiesel","NIRAS' erfaringstall. "]
[null,"Energiforbruk og -kilder anleggsarbeid","Diesel",null,null,null,"Elektrisitet",null,null,null,"Fordeling mellom brensler"]
[null,"Energiforbruk veivals","L/h",{"$f":"IF(F31=\"\",E31,F31)","v":3},3,null,"kW",{"$f":"IF(J31=\"\",0,J31)","v":0},"Ingen standardverdi",null,"%",0,7.0000000000000007E-2,{"$f":"1-M31-L31","v":0.92999999999999994},"Dersom ikke annet er oppgitt, benytt fordelingen 93 % fossil diesel, 7 % biodiesel","NIRAS' erfaringstall. "]
[null,"Energiforbruk traktor","L/h",5,5,null,"kW",{"$f":"IF(J32=\"\",0,J32)","v":0},"Ingen standardverdi",null,"%",0,7.0000000000000007E-2,{"$f":"1-M32-L32","v":0.92999999999999994},"Dersom ikke annet er oppgitt, benytt fordelingen 93 % fossil diesel, 7 % biodiesel","NIRAS' erfaringstall. "]
[null,"Energiforbruk asfaltutlegger","L/h",3,3,null,"kW",0,"Ingen standardverdi",null,"%",0,7.0000000000000007E-2,0.92999999999999994,"Dersom ikke annet er oppgitt, benytt fordelingen 93 % fossil diesel, 7 % biodiesel","NIRAS' erfaringstall. "]
[null,"Energiforbruk gravemaskin","L/h",20,20,null,"kW",0,"Ingen standardverdi",null,"%",0,7.0000000000000007E-2,0.92999999999999994,"Dersom ikke annet er oppgitt, benytt fordelingen 93 % fossil diesel, 7 % biodiesel","NIRAS' erfaringstall. "]
[null,"Energiforbruk grovknuser","L/h",25,25,null,"kW",0,"Ingen standardverdi",null,"%",0,7.0000000000000007E-2,0.92999999999999994,"Dersom ikke annet er oppgitt, benytt fordelingen 93 % fossil diesel, 7 % biodiesel","NIRAS' erfaringstall. "]
[null,"Energiforbruk finknuser","L/h",{"$f":"IF(F36=\"\",E36,F36)","v":25},25,null,"kW",0,"Ingen standardverdi",null,"%",0,7.0000000000000007E-2,0.92999999999999994,"Dersom ikke annet er oppgitt, benytt fordelingen 93 % fossil diesel, 7 % biodiesel","NIRAS' erfaringstall. "]
[null,"Energiforbruk tårnkran til bru og kulvert","L/h",{"$f":"IF(F37=\"\",0,F37)","v":0},"Ingen standardverdi",null,"kW",{"$f":"IF(J37=\"\",I37,J37)","v":48.6},48.6,null,"%",1,0,{"$f":"1-M37-L37","v":0},"Dersom ikke annet er oppgitt, benytt 100 % el","Datablad Potain MDT 178 - 54 kVA. Antar PF 0,9. "]
[null,"Energiforbruk veimerking","L/m",{"$f":"IF(F38=\"\",E38,F38)","v":5.8999999999999999E-3},5.8999999999999999E-3,null,"kW",{"$f":"IF(J38=\"\",0,J38)","v":0},"Ingen standardverdi",null,"%",0,7.0000000000000007E-2,0.92999999999999994,"Dersom ikke annet er oppgitt, benytt fordelingen 93 % fossil diesel, 7 % biodiesel","NIRAS' erfaringstall. "]
[null,"Energiforbruk etablering av grøft","L/m",40,40,null,"kWh/m",0,"Ingen standardverdi",null,"%",0,7.0000000000000007E-2,0.92999999999999994,"Dersom ikke annet er oppgitt, benytt 100 % el","Straume, Krogsæter, NOTAT: Utredning og kravspesifikasjon til EFFEKT 6.6, Del 3: Videreutvikling av Klimamodulen. Lukket grøft til drenering \"Grave grøfteprofil, nedsetting kummer, planering for rør i grøft og stikkrenner, omfylling og gjenfylling. 1 maskintime pr meter grøft\""]
[null,"Energiforbruk anleggsarbeid autovern","L/m",0.4,0.4,null,"kWh/m",{"$f":"IF(J40=\"\",0,J40)","v":0},"Ingen standardverdi",null,"%",0,7.0000000000000007E-2,0.92999999999999994,"Dersom ikke annet er oppgitt, benytt fordelingen 93 % fossil diesel, 7 % biodiesel","Antar at aggregat bakpå en lastebil bruker 4 L/t på utsetting av autovern, og at det legges 80 m autovern per dag for fire-felts vei. Én dag defineres som 8 timer. Da får man 32 liter diesel/dag. 32 liter diesel per dag / 80 m autovern per dag => 0,4 liter diesel/m. Tallet er verifisert av Marianne Gjerde i Arvid Gjerde AS, som i mailkommunikasjon den 14.04.20 sier at deres pelerigg bruker 0,42 liter pr meter montert rekkverk i snitt på ett år."]
[null,"Energiforbruk hjullaster/traktor til kantklipp","L/h",7.5,7.5,null,"kW",{"$f":"IF(J41=\"\",0,J41)","v":0},"Ingen standardverdi",null,"%",0,7.0000000000000007E-2,{"$f":"1-M41-L41","v":0.92999999999999994},"Verdi burde verifiseres med flere kilder. Dersom ikke annet er oppgitt, benytt fordelingen 93 % fossil diesel, 7 % biodiesel","NIRAS' erfaringstall. "]
[null,"Energiforbruk hjullaster/traktor til feiing","L/h",{"$f":"IF(F42=\"\",E42,F42)","v":7.5},7.5,null,"kW",{"$f":"IF(J42=\"\",0,J42)","v":0},"Ingen standardverdi",null,"%",0,7.0000000000000007E-2,{"$f":"1-M42-L42","v":0.92999999999999994},"Verdi burde verifiseres med flere kilder. Forbruk er per felt. Dersom ikke annet er oppgitt, benytt fordelingen 93 % fossil diesel, 7 % biodiesel.","NIRAS' erfaringstall. "]
[null,"Energiforbruk saltbil","L/km",0.64,0.64,null,"kWh/km",{"$f":"IF(J43=\"\",0,J43)","v":0},"Ingen standardverdi",null,"%",0,7.0000000000000007E-2,{"$f":"1-M43-L43","v":0.92999999999999994},"Forbruk er per to felt. Dersom ikke annet er oppgitt, benytt fordelingen 93 % fossil diesel, 7 % biodiesel","Gjennomsnitt for vindervedlikeholdskjøretøy fra \"Life cycle assessment of winter road maintenance\", Vignisdottir et. Al, The International Journal of Life Cycle Assessment (2020) "]
[null,"Energiforbruk brøytebil","L/km",0.64,0.64,null,"kWh/km",{"$f":"IF(J44=\"\",0,J44)","v":0},"Ingen standardverdi",null,"%",0,7.0000000000000007E-2,{"$f":"1-M44-L44","v":0.92999999999999994},"Forbruk er per brøyterunde. Dersom ikke annet er oppgitt, benytt fordelingen 93 % fossil diesel, 7 % biodiesel","Gjennomsnitt for vindervedlikeholdskjøretøy fra \"Life cycle assessment of winter road maintenance\", Vignisdottir et. Al, The International Journal of Life Cycle Assessment (2020) "]
[null,"Arbeidshastighet anleggsmaskiner"]
[null,"Arbeidshastighet veivals ","t/h",{"$f":"IF(F46=\"\",E46,F46)","v":75},75,null,null,null,null,null,null,null,null,null,"Faktoren er satt for å få ca. samme dieselforbruk som i VegLCA: 0,04 L/m2 asfalt lagt.","Samkjøringsprosjektet mellom NV-GHG og VegLCA"]
[null,"Arbeidshastighet traktor ","t/h",300,300,null,null,null,null,null,null,null,null,null,null,"NIRAS' erfaringstall. "]
[null,"Arbeidshastighet asfaltutlegger ","t/h",3.75,3.75,null,null,null,null,null,null,null,null,null,"Faktoren er satt for å få ca. samme dieselforbruk som i VegLCA: 0,8 L/tonn asfalt lagt.","Samkjøringsprosjektet mellom NV-GHG og VegLCA"]
[null,"Arbeidshastighet gravemaskin ","t/h",150,150,null,null,null,null,null,null,null,null,null,null,"NIRAS' erfaringstall. "]
[null,"Arbeidshastighet grovknuser ","t/h",125,125,null,null,null,null,null,null,null,null,null,null,"NIRAS' erfaringstall. "]
[null,"Arbeidshastighet finknuser ","t/h",250,250,null,null,null,null,null,null,null,null,null,null,"NIRAS' erfaringstall. "]
[null,"Arbeidshastighet kran første 400 m2 av bru","m2/h",1.6666666666666667,{"$f":"400/240","v":1.6666666666666667},null,null,null,null,null,null,null,null,null,"Verdi burde verifiseres med flere kilder. Store variasjoner avhengig av brutype, fundamenteringsforhold (geologi) og bruens størrelse. Faktoren kan sannsynligvis variere med pluss/minus 60 % avhengig av forholdene ","NIRAS' erfaringstall. "]
[null,"Arbeidshastighet kran resterende del av bru","m2/h",3.3333333333333335,{"$f":"400/120","v":3.3333333333333335},null,null,null,null,null,null,null,null,null,"Verdi burde verifiseres med flere kilder. Store variasjoner avhengig av brutype, fundamenteringsforhold (geologi) og bruens størrelse. Faktoren kan sannsynligvis variere med pluss/minus 60 % avhengig av forholdene ","NIRAS' erfaringstall. "]
[null,"Arbeidshastighet kran kulvert","h/stk",18,18,null,null,null,null,null,null,null,null,null,"For en prefabrikert elementkulvert ca. 10 timer. For en plasstøpt ca 25 timer. Bruker 18 timer som et gjennomsnitt. Verdi burde verifiseres med flere kilder.","NIRAS' erfaringstall. "]
[null,"Arbeidshastighet gravemaskin grøfterensk","m/h",300,300,null,null,null,null,null,null,null,null,null,null,"NIRAS' erfaringstall. "]
[null,"Arbeidshastighet traktor/hjullaster feiing","m/h",2000,2000,null,null,null,null,null,null,null,null,null,null,"NIRAS' erfaringstall. "]
[null,"Arbeidshastighet traktor/hjullaster kantklipp","m/h",7500,{"$f":"1000/(8/60)","v":7500},null,null,null,null,null,null,null,null,null,null,"Arbeidshastighet er gjennomsnitt av verdier oppgitt av Maskinimportøren den 15.04.20, som sier deres traktor til kantklipping bruker ca. 8 min på å klippe 1-1,25 m kant i 1 km"]

{"sheet":"Utslippsfaktorer","index":4,"n_rows":30,"n_cols":9,"rows_kept":30,"cut":false,"hidden":false,"merged":[]}
[]
[null,"Innsatsfaktor","Enhet","Utslippsfaktor brukt i beregninger","Standard utslippsfaktor","Prosjektspesifikk utslippsfaktor","Kommentar","Dokumentasjon standardverdi","Dokumentasjon prosjektspesifikk verdi"]
[null,"Materialer"]
[null,"Aluminium","kg CO2e/kg",{"$f":"IF(F4=\"\",E4,F4)","v":"-"},"-",null,"Brukes ikke i denne versjonen"]
[null,"Armeringsstål","kg CO2e/kg",{"$f":"IF(F5=\"\",E5,F5)","v":0.61860000000000004},0.61860000000000004,null,null,"Gjennomsnitt av tre EPD'er på det norske markedet; NEPD-2084-939-EN (A1-A4), NEPD-2083-939-EN (A1-A4) og NEPD-2082-939-EN (A1-A4)"]
[null,"Asfaltgrusbetong (Agb)","kg CO2e/kg",5.1200000000000002E-2,5.1200000000000002E-2,null,null,"NEPD-1390-456-NO (A1-A3). Bransjegjennomsnitt, EPD utarbeidet av EBA (Entreprenørforeningen Bygg og Anlegg) v/Lemminkainen Norge AS, Skanska Asfalt AS, Peab Asfalt AS, NCC Industry og Veidekke Industri AS"]
[null,"Skjelettasfalt (Ska)","kg CO2e/kg",{"$f":"IF(F7=\"\",E7,F7)","v":6.5699999999999995E-2},6.5699999999999995E-2,null,null,"NEPD-1391-456-NO (A1-A3). Bransjegjennomsnitt, EPD utarbeidet av EBA (Entreprenørforeningen Bygg og Anlegg) v/Lemminkainen Norge AS, Skanska Asfalt AS, Peab Asfalt AS, NCC Industry og Veidekke Industri AS"]
[null,"Asfaltgrus (Ag)","kg CO2e/kg",4.8800000000000003E-2,4.8800000000000003E-2,null,null,"NEPD-1489-456-NO (A1-A3). Bransjegjennomsnitt, EPD utarbeidet av EBA (Entreprenørforeningen Bygg og Anlegg) v/Lemminkainen Norge AS, Skanska Asfalt AS, Peab Asfalt AS, NCC Industry og Veidekke Industri AS"]
[null,"Topeka","kg CO2e/kg",{"$f":"IF(F9=\"\",E9,F9)","v":0.184},0.184,null,null,"Antatt likt som støpeasfalt; 'Mastic asphalt' hentet fra Ecoinvent v3 med nordisk el-mix 2012-2016 i produksjon. Som VegLCA."]
[null,"Betong","kg CO2e/kg",0.13750000000000001,0.13750000000000001,null,"Baseline: =410/2400","NB 37 (2019). Bransjereferanse for B35. NB 37 sier at ved omgjøring fra kg/kg til kg/m3 skal densiteten 2400 kg/m3 brukes."]
[null,"PE-skum","kg CO2e/kg","-","-",null,"Brukes ikke i denne versjonen"]
[null,"Salt","kg CO2e/kg",0.17899999999999999,0.17899999999999999,null,null,"EcoInvent; \"Sodium chloride, powder {RER} | production | Conseq, U\""]
[null,"Sprøytebetong","kg CO2e/kg",0.25240000000000001,0.25240000000000001,null,null,"NEPD-1509-512-EN (A1-A4)."]
[null,"Stål","kg CO2e/kg",2.1234999999999999,2.1234999999999999,null,null,"Gjennomsnitt av tre EPD'er på det norske markedet; NEPD-1914-839-EN (A1-A4), NEPD-1915-839-EN (A1-A4) og NEPD-1928-851-SE (A1-A4)"]
[null,"XPS","kg CO2e/kg",3.7109999999999999,3.7109999999999999,null,null,"NEPD-396-274-NO (A1-A4). Sundolitt, Brødrene Sunde AS. 33mm tykkelse"]
[null,"XPS/betongelement","kg CO2e/m2",66.814999999999998,66.814999999999998,null,null,"NEPD-351-243-NO (A1-A4). Elementene består av 150mm betong og 50mm XPS kpa isolasjon, til sammen 200mm tykkelse."]
[null,"Energi"]
[null,"Biodiesel (WTT)","kg CO2e/liter",1.92,1.92,null,null,"NS-EN 16258:2012. Tabell A.1 Biodiesel \"well to tank\""]
[null,"Fossil diesel forbrenning (TTW)","kg CO2e/liter",2.67,2.67,null,null,"NS-EN 16258:2012. Tabell A.1 Diesel \"tank to wheel\""]
[null,"Fossil diesel (WTW)","kg CO2e/liter",3.24,3.24,null,null,"NS-EN 16258-2012. Tabell A.1 Diesel \"well to wheel\""]
[null,"Sprengstoff (CTG)","kg CO2e/kg",2.6779999999999999,2.6779999999999999,null,null,"NEPD-1591-615-EN (A1-A4)."]
[null,"Sprengstoff detonering","kg CO2e/kg",0.152,0.152,null,null,"NEPD-1591-615-EN (A5-2)."]
[null,"Elektrisitet anleggsfase, norsk miks","kg CO2e/kWh",{"$f":"IF(F23=\"\",E23,F23)","v":2.6380000000000001E-2},2.6380000000000001E-2,null,null,"NS 3720:2018. Utslipp for år 2020 er estimert med utgangspunkt i utslipp for 2015 der det antas at den årlige reduksjonen er lineær frem mot 2050."]
[null,"Elektrisitet 55 år, europeisk miks","kg CO2e/kWh",{"$f":"IF(F24=\"\",E24,F24)","v":0.13600000000000001},0.13600000000000001,null,null,"NS 3720:2018. Estimerte utslipp i år 2075."]
[null,"Arealbruk"]
[null,"Skog - lav bonitet","kg CO2e/m2",{"$f":"IF(F26=\"\",E26,F26)","v":60.4},{"$f":"12+48.4","v":60.4},null,null,"\"Metode for beregning av CO2-utslipp knyttet til arealbeslag ved vegbygging\" (Asplan Viak, 2015). Tabell 3"]
[null,"Skog - middels bonitet","kg CO2e/m2",{"$f":"IF(F27=\"\",E27,F27)","v":68.7},{"$f":"20.3+48.4","v":68.7},null,null,"\"Metode for beregning av CO2-utslipp knyttet til arealbeslag ved vegbygging\" (Asplan Viak, 2015). Tabell 3"]
[null,"Skog - høy bonitet","kg CO2e/m2",{"$f":"IF(F28=\"\",E28,F28)","v":80.3},{"$f":"31.9+48.4","v":80.3},null,null,"\"Metode for beregning av CO2-utslipp knyttet til arealbeslag ved vegbygging\" (Asplan Viak, 2015). Tabell 3"]
[null,"Myr","kg CO2e/m2",{"$f":"IF(F29=\"\",E29,F29)","v":201.9},{"$f":"201.9","v":201.9},null,null,"\"Metode for beregning av CO2-utslipp knyttet til arealbeslag ved vegbygging\" (Asplan Viak, 2015). Tabell 3"]
[null,"Jordbruksareal","kg CO2e/m2",{"$f":"IF(F30=\"\",E30,F30)","v":55.1},{"$f":"55.1","v":55.1},null,null,"\"Metode for beregning av CO2-utslipp knyttet til arealbeslag ved vegbygging\" (Asplan Viak, 2015). Tabell 3"]

{"sheet":"Resultat","index":5,"n_rows":157,"n_cols":64,"rows_kept":157,"cut":false,"hidden":false,"merged":[[3,1,4,1],[3,2,4,2],[153,7,153,9],[154,7,154,8]]}
[]
[]
[null,"Tabell 1: Utslipp over livsløpet i tonn CO2e"]
[null,"Kategori","Totalt over analyseperiode","År i livsløpet"]
[null,null,null,0,1,2,3,4,5,6,7,8,9,10,11,12,13,14,15,16,17,18,19,20,21,22,23,24,25,26,27,28,29,30,31,32,33,34,35,36,37,38,39,40,41,42,43,44,45,46,47,48,49,50,51,52,53,54,55,56,57,58,59,60]
[null,"Byggefase",{"$f":"SUMIF($D$5:$BL$5,\"<=\" & 'Prosjektbeskrivelse og inndata'!$C$14,D6:BL6)","v":5216.7717065533816},{"$f":"IFERROR(SUMIF(Beregninger!G:G,\"År 0\",Beregninger!M:M),\"Ikke definert\")","v":5216.7717065533816},0,0,0,0,0,0,0,0,0,0,0,0,0,0,0,0,0,0,0,0,0,0,0,0,0,0,0,0,0,0,0,0,0,0,0,0,0,0,0,0,0,0,0,0,0,0,0,0,0,0,0,0,0,0,0,0,0,0,0,0]
[null,"Arealbruk",{"$f":"SUMIF($D$5:$BL$5,\"<=\" & 'Prosjektbeskrivelse og inndata'!$C$14,D7:BL7)","v":7425.5556363636369},{"$f":"C147","v":7425.5556363636369},0,0,0,0,0,0,0,0,0,0,0,0,0,0,0,0,0,0,0,0,0,0,0,0,0,0,0,0,0,0,0,0,0,0,0,0,0,0,0,0,0,0,0,0,0,0,0,0,0,0,0,0,0,0,0,0,0,0,0,0]
[null,"Drift",{"$f":"SUMIF($D$5:$BL$5,\"<=\" & 'Prosjektbeskrivelse og inndata'!$C$14,D8:BL8)","v":4195.8198863555781},0,{"$f":"SUMIFS(Beregninger!O$126:O$311,Beregninger!$H$126:$H$311,Resultat!$B8)","v":68.582595218859552},{"$f":"SUMIFS(Beregninger!P$126:P$311,Beregninger!$H$126:$H$311,Resultat!$B8)","v":68.582595218859552},{"$f":"SUMIFS(Beregninger!Q$126:Q$311,Beregninger!$H$126:$H$311,Resultat!$B8)","v":72.625803880059564},{"$f":"SUMIFS(Beregninger!R$126:R$311,Beregninger!$H$126:$H$311,Resultat!$B8)","v":68.582595218859552},{"$f":"SUMIFS(Beregninger!S$126:S$311,Beregninger!$H$126:$H$311,Resultat!$B8)","v":68.582595218859552},{"$f":"SUMIFS(Beregninger!T$126:T$311,Beregninger!$H$126:$H$311,Resultat!$B8)","v":72.625803880059564},{"$f":"SUMIFS(Beregninger!U$126:U$311,Beregninger!$H$126:$H$311,Resultat!$B8)","v":68.582595218859552},{"$f":"SUMIFS(Beregninger!V$126:V$311,Beregninger!$H$126:$H$311,Resultat!$B8)","v":68.582595218859552},{"$f":"SUMIFS(Beregninger!W$126:W$311,Beregninger!$H$126:$H$311,Resultat!$B8)","v":72.625803880059564},{"$f":"SUMIFS(Beregninger!X$126:X$311,Beregninger!$H$126:$H$311,Resultat!$B8)","v":68.582595218859552},{"$f":"SUMIFS(Beregninger!Y$126:Y$311,Beregninger!$H$126:$H$311,Resultat!$B8)","v":68.582595218859552},{"$f":"SUMIFS(Beregninger!Z$126:Z$311,Beregninger!$H$126:$H$311,Resultat!$B8)","v":72.625803880059564},{"$f":"SUMIFS(Beregninger!AA$126:AA$311,Beregninger!$H$126:$H$311,Resultat!$B8)","v":68.582595218859552},{"$f":"SUMIFS(Beregninger!AB$126:AB$311,Beregninger!$H$126:$H$311,Resultat!$B8)","v":68.582595218859552},{"$f":"SUMIFS(Beregninger!AC$126:AC$311,Beregninger!$H$126:$H$311,Resultat!$B8)","v":72.625803880059564},{"$f":"SUMIFS(Beregninger!AD$126:AD$311,Beregninger!$H$126:$H$311,Resultat!$B8)","v":68.582595218859552},{"$f":"SUMIFS(Beregninger!AE$126:AE$311,Beregninger!$H$126:$H$311,Resultat!$B8)","v":68.582595218859552},{"$f":"SUMIFS(Beregninger!AF$126:AF$311,Beregninger!$H$126:$H$311,Resultat!$B8)","v":72.625803880059564},{"$f":"SUMIFS(Beregninger!AG$126:AG$311,Beregninger!$H$126:$H$311,Resultat!$B8)","v":68.582595218859552},{"$f":"SUMIFS(Beregninger!AH$126:AH$311,Beregninger!$H$126:$H$311,Resultat!$B8)","v":68.582595218859552},{"$f":"SUMIFS(Beregninger!AI$126:AI$311,Beregninger!$H$126:$H$311,Resultat!$B8)","v":72.625803880059564},{"$f":"SUMIFS(Beregninger!AJ$126:AJ$311,Beregninger!$H$126:$H$311,Resultat!$B8)","v":68.582595218859552},{"$f":"SUMIFS(Beregninger!AK$126:AK$311,Beregninger!$H$126:$H$311,Resultat!$B8)","v":68.582595218859552},{"$f":"SUMIFS(Beregninger!AL$126:AL$311,Beregninger!$H$126:$H$311,Resultat!$B8)","v":72.625803880059564},{"$f":"SUMIFS(Beregninger!AM$126:AM$311,Beregninger!$H$126:$H$311,Resultat!$B8)","v":68.582595218859552},{"$f":"SUMIFS(Beregninger!AN$126:AN$311,Beregninger!$H$126:$H$311,Resultat!$B8)","v":68.582595218859552},{"$f":"SUMIFS(Beregninger!AO$126:AO$311,Beregninger!$H$126:$H$311,Resultat!$B8)","v":72.625803880059564},{"$f":"SUMIFS(Beregninger!AP$126:AP$311,Beregninger!$H$126:$H$311,Resultat!$B8)","v":68.582595218859552},{"$f":"SUMIFS(Beregninger!AQ$126:AQ$311,Beregninger!$H$126:$H$311,Resultat!$B8)","v":68.582595218859552},{"$f":"SUMIFS(Beregninger!AR$126:AR$311,Beregninger!$H$126:$H$311,Resultat!$B8)","v":72.625803880059564},{"$f":"SUMIFS(Beregninger!AS$126:AS$311,Beregninger!$H$126:$H$311,Resultat!$B8)","v":68.582595218859552},{"$f":"SUMIFS(Beregninger!AT$126:AT$311,Beregninger!$H$126:$H$311,Resultat!$B8)","v":68.582595218859552},{"$f":"SUMIFS(Beregninger!AU$126:AU$311,Beregninger!$H$126:$H$311,Resultat!$B8)","v":72.625803880059564},{"$f":"SUMIFS(Beregninger!AV$126:AV$311,Beregninger!$H$126:$H$311,Resultat!$B8)","v":68.582595218859552},{"$f":"SUMIFS(Beregninger!AW$126:AW$311,Beregninger!$H$126:$H$311,Resultat!$B8)","v":68.582595218859552},{"$f":"SUMIFS(Beregninger!AX$126:AX$311,Beregninger!$H$126:$H$311,Resultat!$B8)","v":72.625803880059564},{"$f":"SUMIFS(Beregninger!AY$126:AY$311,Beregninger!$H$126:$H$311,Resultat!$B8)","v":68.582595218859552},{"$f":"SUMIFS(Beregninger!AZ$126:AZ$311,Beregninger!$H$126:$H$311,Resultat!$B8)","v":68.582595218859552},{"$f":"SUMIFS(Beregninger!BA$126:BA$311,Beregninger!$H$126:$H$311,Resultat!$B8)","v":72.625803880059564},{"$f":"SUMIFS(Beregninger!BB$126:BB$311,Beregninger!$H$126:$H$311,Resultat!$B8)","v":68.582595218859552},{"$f":"SUMIFS(Beregninger!BC$126:BC$311,Beregninger!$H$126:$H$311,Resultat!$B8)","v":68.582595218859552},{"$f":"SUMIFS(Beregninger!BD$126:BD$311,Beregninger!$H$126:$H$311,Resultat!$B8)","v":72.625803880059564},{"$f":"SUMIFS(Beregninger!BE$126:BE$311,Beregninger!$H$126:$H$311,Resultat!$B8)","v":68.582595218859552},{"$f":"SUMIFS(Beregninger!BF$126:BF$311,Beregninger!$H$126:$H$311,Resultat!$B8)","v":68.582595218859552},{"$f":"SUMIFS(Beregninger!BG$126:BG$311,Beregninger!$H$126:$H$311,Resultat!$B8)","v":72.625803880059564},{"$f":"SUMIFS(Beregninger!BH$126:BH$311,Beregninger!$H$126:$H$311,Resultat!$B8)","v":68.582595218859552},{"$f":"SUMIFS(Beregninger!BI$126:BI$311,Beregninger!$H$126:$H$311,Resultat!$B8)","v":68.582595218859552},{"$f":"SUMIFS(Beregninger!BJ$126:BJ$311,Beregninger!$H$126:$H$311,Resultat!$B8)","v":72.625803880059564},{"$f":"SUMIFS(Beregninger!BK$126:BK$311,Beregninger!$H$126:$H$311,Resultat!$B8)","v":68.582595218859552},{"$f":"SUMIFS(Beregninger!BL$126:BL$311,Beregninger!$H$126:$H$311,Resultat!$B8)","v":68.582595218859552},{"$f":"SUMIFS(Beregninger!BM$126:BM$311,Beregninger!$H$126:$H$311,Resultat!$B8)","v":72.625803880059564},{"$f":"SUMIFS(Beregninger!BN$126:BN$311,Beregninger!$H$126:$H$311,Resultat!$B8)","v":68.582595218859552},{"$f":"SUMIFS(Beregninger!BO$126:BO$311,Beregninger!$H$126:$H$311,Resultat!$B8)","v":68.582595218859552},{"$f":"SUMIFS(Beregninger!BP$126:BP$311,Beregninger!$H$126:$H$311,Resultat!$B8)","v":72.625803880059564},{"$f":"SUMIFS(Beregninger!BQ$126:BQ$311,Beregninger!$H$126:$H$311,Resultat!$B8)","v":68.582595218859552},{"$f":"SUMIFS(Beregninger!BR$126:BR$311,Beregninger!$H$126:$H$311,Resultat!$B8)","v":68.582595218859552},{"$f":"SUMIFS(Beregninger!BS$126:BS$311,Beregninger!$H$126:$H$311,Resultat!$B8)","v":72.625803880059564},{"$f":"SUMIFS(Beregninger!BT$126:BT$311,Beregninger!$H$126:$H$311,Resultat!$B8)","v":68.582595218859552},{"$f":"SUMIFS(Beregninger!BU$126:BU$311,Beregninger!$H$126:$H$311,Resultat!$B8)","v":68.582595218859552},{"$f":"SUMIFS(Beregninger!BV$126:BV$311,Beregninger!$H$126:$H$311,Resultat!$B8)","v":72.625803880059564}]
[null,"Vedlikehold",{"$f":"SUMIF($D$5:$BL$5,\"<=\" & 'Prosjektbeskrivelse og inndata'!$C$14,D9:BL9)","v":1656.6239747892785},0,{"$f":"SUMIFS(Beregninger!O$126:O$311,Beregninger!$H$126:$H$311,Resultat!$B9)","v":0},{"$f":"SUMIFS(Beregninger!P$126:P$311,Beregninger!$H$126:$H$311,Resultat!$B9)","v":0},{"$f":"SUMIFS(Beregninger!Q$126:Q$311,Beregninger!$H$126:$H$311,Resultat!$B9)","v":0},{"$f":"SUMIFS(Beregninger!R$126:R$311,Beregninger!$H$126:$H$311,Resultat!$B9)","v":0},{"$f":"SUMIFS(Beregninger!S$126:S$311,Beregninger!$H$126:$H$311,Resultat!$B9)","v":0},{"$f":"SUMIFS(Beregninger!T$126:T$311,Beregninger!$H$126:$H$311,Resultat!$B9)","v":0},{"$f":"SUMIFS(Beregninger!U$126:U$311,Beregninger!$H$126:$H$311,Resultat!$B9)","v":0},{"$f":"SUMIFS(Beregninger!V$126:V$311,Beregninger!$H$126:$H$311,Resultat!$B9)","v":0},{"$f":"SUMIFS(Beregninger!W$126:W$311,Beregninger!$H$126:$H$311,Resultat!$B9)","v":0},{"$f":"SUMIFS(Beregninger!X$126:X$311,Beregninger!$H$126:$H$311,Resultat!$B9)","v":0},{"$f":"SUMIFS(Beregninger!Y$126:Y$311,Beregninger!$H$126:$H$311,Resultat!$B9)","v":0},{"$f":"SUMIFS(Beregninger!Z$126:Z$311,Beregninger!$H$126:$H$311,Resultat!$B9)","v":0},{"$f":"SUMIFS(Beregninger!AA$126:AA$311,Beregninger!$H$126:$H$311,Resultat!$B9)","v":0},{"$f":"SUMIFS(Beregninger!AB$126:AB$311,Beregninger!$H$126:$H$311,Resultat!$B9)","v":0},{"$f":"SUMIFS(Beregninger!AC$126:AC$311,Beregninger!$H$126:$H$311,Resultat!$B9)","v":0},{"$f":"SUMIFS(Beregninger!AD$126:AD$311,Beregninger!$H$126:$H$311,Resultat!$B9)","v":0},{"$f":"SUMIFS(Beregninger!AE$126:AE$311,Beregninger!$H$126:$H$311,Resultat!$B9)","v":0},{"$f":"SUMIFS(Beregninger!AF$126:AF$311,Beregninger!$H$126:$H$311,Resultat!$B9)","v":0},{"$f":"SUMIFS(Beregninger!AG$126:AG$311,Beregninger!$H$126:$H$311,Resultat!$B9)","v":0},{"$f":"SUMIFS(Beregninger!AH$126:AH$311,Beregninger!$H$126:$H$311,Resultat!$B9)","v":0},{"$f":"SUMIFS(Beregninger!AI$126:AI$311,Beregninger!$H$126:$H$311,Resultat!$B9)","v":0},{"$f":"SUMIFS(Beregninger!AJ$126:AJ$311,Beregninger!$H$126:$H$311,Resultat!$B9)","v":0},{"$f":"SUMIFS(Beregninger!AK$126:AK$311,Beregninger!$H$126:$H$311,Resultat!$B9)","v":0},{"$f":"SUMIFS(Beregninger!AL$126:AL$311,Beregninger!$H$126:$H$311,Resultat!$B9)","v":0},{"$f":"SUMIFS(Beregninger!AM$126:AM$311,Beregninger!$H$126:$H$311,Resultat!$B9)","v":0},{"$f":"SUMIFS(Beregninger!AN$126:AN$311,Beregninger!$H$126:$H$311,Resultat!$B9)","v":0},{"$f":"SUMIFS(Beregninger!AO$126:AO$311,Beregninger!$H$126:$H$311,Resultat!$B9)","v":0},{"$f":"SUMIFS(Beregninger!AP$126:AP$311,Beregninger!$H$126:$H$311,Resultat!$B9)","v":0},{"$f":"SUMIFS(Beregninger!AQ$126:AQ$311,Beregninger!$H$126:$H$311,Resultat!$B9)","v":0},{"$f":"SUMIFS(Beregninger!AR$126:AR$311,Beregninger!$H$126:$H$311,Resultat!$B9)","v":828.31198739463923},{"$f":"SUMIFS(Beregninger!AS$126:AS$311,Beregninger!$H$126:$H$311,Resultat!$B9)","v":0},{"$f":"SUMIFS(Beregninger!AT$126:AT$311,Beregninger!$H$126:$H$311,Resultat!$B9)","v":0},{"$f":"SUMIFS(Beregninger!AU$126:AU$311,Beregninger!$H$126:$H$311,Resultat!$B9)","v":0},{"$f":"SUMIFS(Beregninger!AV$126:AV$311,Beregninger!$H$126:$H$311,Resultat!$B9)","v":0},{"$f":"SUMIFS(Beregninger!AW$126:AW$311,Beregninger!$H$126:$H$311,Resultat!$B9)","v":0},{"$f":"SUMIFS(Beregninger!AX$126:AX$311,Beregninger!$H$126:$H$311,Resultat!$B9)","v":0},{"$f":"SUMIFS(Beregninger!AY$126:AY$311,Beregninger!$H$126:$H$311,Resultat!$B9)","v":0},{"$f":"SUMIFS(Beregninger!AZ$126:AZ$311,Beregninger!$H$126:$H$311,Resultat!$B9)","v":0},{"$f":"SUMIFS(Beregninger!BA$126:BA$311,Beregninger!$H$126:$H$311,Resultat!$B9)","v":0},{"$f":"SUMIFS(Beregninger!BB$126:BB$311,Beregninger!$H$126:$H$311,Resultat!$B9)","v":0},{"$f":"SUMIFS(Beregninger!BC$126:BC$311,Beregninger!$H$126:$H$311,Resultat!$B9)","v":0},{"$f":"SUMIFS(Beregninger!BD$126:BD$311,Beregninger!$H$126:$H$311,Resultat!$B9)","v":0},{"$f":"SUMIFS(Beregninger!BE$126:BE$311,Beregninger!$H$126:$H$311,Resultat!$B9)","v":0},{"$f":"SUMIFS(Beregninger!BF$126:BF$311,Beregninger!$H$126:$H$311,Resultat!$B9)","v":0},{"$f":"SUMIFS(Beregninger!BG$126:BG$311,Beregninger!$H$126:$H$311,Resultat!$B9)","v":0},{"$f":"SUMIFS(Beregninger!BH$126:BH$311,Beregninger!$H$126:$H$311,Resultat!$B9)","v":0},{"$f":"SUMIFS(Beregninger!BI$126:BI$311,Beregninger!$H$126:$H$311,Resultat!$B9)","v":0},{"$f":"SUMIFS(Beregninger!BJ$126:BJ$311,Beregninger!$H$126:$H$311,Resultat!$B9)","v":0},{"$f":"SUMIFS(Beregninger!BK$126:BK$311,Beregninger!$H$126:$H$311,Resultat!$B9)","v":0},{"$f":"SUMIFS(Beregninger!BL$126:BL$311,Beregninger!$H$126:$H$311,Resultat!$B9)","v":0},{"$f":"SUMIFS(Beregninger!BM$126:BM$311,Beregninger!$H$126:$H$311,Resultat!$B9)","v":0},{"$f":"SUMIFS(Beregninger!BN$126:BN$311,Beregninger!$H$126:$H$311,Resultat!$B9)","v":0},{"$f":"SUMIFS(Beregninger!BO$126:BO$311,Beregninger!$H$126:$H$311,Resultat!$B9)","v":0},{"$f":"SUMIFS(Beregninger!BP$126:BP$311,Beregninger!$H$126:$H$311,Resultat!$B9)","v":0},{"$f":"SUMIFS(Beregninger!BQ$126:BQ$311,Beregninger!$H$126:$H$311,Resultat!$B9)","v":0},{"$f":"SUMIFS(Beregninger!BR$126:BR$311,Beregninger!$H$126:$H$311,Resultat!$B9)","v":0},{"$f":"SUMIFS(Beregninger!BS$126:BS$311,Beregninger!$H$126:$H$311,Resultat!$B9)","v":0},{"$f":"SUMIFS(Beregninger!BT$126:BT$311,Beregninger!$H$126:$H$311,Resultat!$B9)","v":0},{"$f":"SUMIFS(Beregninger!BU$126:BU$311,Beregninger!$H$126:$H$311,Resultat!$B9)","v":0},{"$f":"SUMIFS(Beregninger!BV$126:BV$311,Beregninger!$H$126:$H$311,Resultat!$B9)","v":828.31198739463923}]
[null,"Reasfaltering",{"$f":"SUMIF($D$5:$BL$5,\"<=\" & 'Prosjektbeskrivelse og inndata'!$C$14,D10:BL10)","v":1380.4791587337604},0,{"$f":"SUMIFS(Beregninger!O$126:O$311,Beregninger!$H$126:$H$311,Resultat!$B10)","v":0},{"$f":"SUMIFS(Beregninger!P$126:P$311,Beregninger!$H$126:$H$311,Resultat!$B10)","v":0},{"$f":"SUMIFS(Beregninger!Q$126:Q$311,Beregninger!$H$126:$H$311,Resultat!$B10)","v":0},{"$f":"SUMIFS(Beregninger!R$126:R$311,Beregninger!$H$126:$H$311,Resultat!$B10)","v":0},{"$f":"SUMIFS(Beregninger!S$126:S$311,Beregninger!$H$126:$H$311,Resultat!$B10)","v":0},{"$f":"SUMIFS(Beregninger!T$126:T$311,Beregninger!$H$126:$H$311,Resultat!$B10)","v":0},{"$f":"SUMIFS(Beregninger!U$126:U$311,Beregninger!$H$126:$H$311,Resultat!$B10)","v":172.55989484172005},{"$f":"SUMIFS(Beregninger!V$126:V$311,Beregninger!$H$126:$H$311,Resultat!$B10)","v":0},{"$f":"SUMIFS(Beregninger!W$126:W$311,Beregninger!$H$126:$H$311,Resultat!$B10)","v":0},{"$f":"SUMIFS(Beregninger!X$126:X$311,Beregninger!$H$126:$H$311,Resultat!$B10)","v":0},{"$f":"SUMIFS(Beregninger!Y$126:Y$311,Beregninger!$H$126:$H$311,Resultat!$B10)","v":0},{"$f":"SUMIFS(Beregninger!Z$126:Z$311,Beregninger!$H$126:$H$311,Resultat!$B10)","v":0},{"$f":"SUMIFS(Beregninger!AA$126:AA$311,Beregninger!$H$126:$H$311,Resultat!$B10)","v":0},{"$f":"SUMIFS(Beregninger!AB$126:AB$311,Beregninger!$H$126:$H$311,Resultat!$B10)","v":172.55989484172005},{"$f":"SUMIFS(Beregninger!AC$126:AC$311,Beregninger!$H$126:$H$311,Resultat!$B10)","v":0},{"$f":"SUMIFS(Beregninger!AD$126:AD$311,Beregninger!$H$126:$H$311,Resultat!$B10)","v":0},{"$f":"SUMIFS(Beregninger!AE$126:AE$311,Beregninger!$H$126:$H$311,Resultat!$B10)","v":0},{"$f":"SUMIFS(Beregninger!AF$126:AF$311,Beregninger!$H$126:$H$311,Resultat!$B10)","v":0},{"$f":"SUMIFS(Beregninger!AG$126:AG$311,Beregninger!$H$126:$H$311,Resultat!$B10)","v":0},{"$f":"SUMIFS(Beregninger!AH$126:AH$311,Beregninger!$H$126:$H$311,Resultat!$B10)","v":0},{"$f":"SUMIFS(Beregninger!AI$126:AI$311,Beregninger!$H$126:$H$311,Resultat!$B10)","v":172.55989484172005},{"$f":"SUMIFS(Beregninger!AJ$126:AJ$311,Beregninger!$H$126:$H$311,Resultat!$B10)","v":0},{"$f":"SUMIFS(Beregninger!AK$126:AK$311,Beregninger!$H$126:$H$311,Resultat!$B10)","v":0},{"$f":"SUMIFS(Beregninger!AL$126:AL$311,Beregninger!$H$126:$H$311,Resultat!$B10)","v":0},{"$f":"SUMIFS(Beregninger!AM$126:AM$311,Beregninger!$H$126:$H$311,Resultat!$B10)","v":0},{"$f":"SUMIFS(Beregninger!AN$126:AN$311,Beregninger!$H$126:$H$311,Resultat!$B10)","v":0},{"$f":"SUMIFS(Beregninger!AO$126:AO$311,Beregninger!$H$126:$H$311,Resultat!$B10)","v":0},{"$f":"SUMIFS(Beregninger!AP$126:AP$311,Beregninger!$H$126:$H$311,Resultat!$B10)","v":172.55989484172005},{"$f":"SUMIFS(Beregninger!AQ$126:AQ$311,Beregninger!$H$126:$H$311,Resultat!$B10)","v":0},{"$f":"SUMIFS(Beregninger!AR$126:AR$311,Beregninger!$H$126:$H$311,Resultat!$B10)","v":0},{"$f":"SUMIFS(Beregninger!AS$126:AS$311,Beregninger!$H$126:$H$311,Resultat!$B10)","v":0},{"$f":"SUMIFS(Beregninger!AT$126:AT$311,Beregninger!$H$126:$H$311,Resultat!$B10)","v":0},{"$f":"SUMIFS(Beregninger!AU$126:AU$311,Beregninger!$H$126:$H$311,Resultat!$B10)","v":0},{"$f":"SUMIFS(Beregninger!AV$126:AV$311,Beregninger!$H$126:$H$311,Resultat!$B10)","v":0},{"$f":"SUMIFS(Beregninger!AW$126:AW$311,Beregninger!$H$126:$H$311,Resultat!$B10)","v":172.55989484172005},{"$f":"SUMIFS(Beregninger!AX$126:AX$311,Beregninger!$H$126:$H$311,Resultat!$B10)","v":0},{"$f":"SUMIFS(Beregninger!AY$126:AY$311,Beregninger!$H$126:$H$311,Resultat!$B10)","v":0},{"$f":"SUMIFS(Beregninger!AZ$126:AZ$311,Beregninger!$H$126:$H$311,Resultat!$B10)","v":0},{"$f":"SUMIFS(Beregninger!BA$126:BA$311,Beregninger!$H$126:$H$311,Resultat!$B10)","v":0},{"$f":"SUMIFS(Beregninger!BB$126:BB$311,Beregninger!$H$126:$H$311,Resultat!$B10)","v":0},{"$f":"SUMIFS(Beregninger!BC$126:BC$311,Beregninger!$H$126:$H$311,Resultat!$B10)","v":0},{"$f":"SUMIFS(Beregninger!BD$126:BD$311,Beregninger!$H$126:$H$311,Resultat!$B10)","v":172.55989484172005},{"$f":"SUMIFS(Beregninger!BE$126:BE$311,Beregninger!$H$126:$H$311,Resultat!$B10)","v":0},{"$f":"SUMIFS(Beregninger!BF$126:BF$311,Beregninger!$H$126:$H$311,Resultat!$B10)","v":0},{"$f":"SUMIFS(Beregninger!BG$126:BG$311,Beregninger!$H$126:$H$311,Resultat!$B10)","v":0},{"$f":"SUMIFS(Beregninger!BH$126:BH$311,Beregninger!$H$126:$H$311,Resultat!$B10)","v":0},{"$f":"SUMIFS(Beregninger!BI$126:BI$311,Beregninger!$H$126:$H$311,Resultat!$B10)","v":0},{"$f":"SUMIFS(Beregninger!BJ$126:BJ$311,Beregninger!$H$126:$H$311,Resultat!$B10)","v":0},{"$f":"SUMIFS(Beregninger!BK$126:BK$311,Beregninger!$H$126:$H$311,Resultat!$B10)","v":172.55989484172005},{"$f":"SUMIFS(Beregninger!BL$126:BL$311,Beregninger!$H$126:$H$311,Resultat!$B10)","v":0},{"$f":"SUMIFS(Beregninger!BM$126:BM$311,Beregninger!$H$126:$H$311,Resultat!$B10)","v":0},{"$f":"SUMIFS(Beregninger!BN$126:BN$311,Beregninger!$H$126:$H$311,Resultat!$B10)","v":0},{"$f":"SUMIFS(Beregninger!BO$126:BO$311,Beregninger!$H$126:$H$311,Resultat!$B10)","v":0},{"$f":"SUMIFS(Beregninger!BP$126:BP$311,Beregninger!$H$126:$H$311,Resultat!$B10)","v":0},{"$f":"SUMIFS(Beregninger!BQ$126:BQ$311,Beregninger!$H$126:$H$311,Resultat!$B10)","v":0},{"$f":"SUMIFS(Beregninger!BR$126:BR$311,Beregninger!$H$126:$H$311,Resultat!$B10)","v":172.55989484172005},{"$f":"SUMIFS(Beregninger!BS$126:BS$311,Beregninger!$H$126:$H$311,Resultat!$B10)","v":0},{"$f":"SUMIFS(Beregninger!BT$126:BT$311,Beregninger!$H$126:$H$311,Resultat!$B10)","v":0},{"$f":"SUMIFS(Beregninger!BU$126:BU$311,Beregninger!$H$126:$H$311,Resultat!$B10)","v":0},{"$f":"SUMIFS(Beregninger!BV$126:BV$311,Beregninger!$H$126:$H$311,Resultat!$B10)","v":0}]
[null,"Totalt",{"$f":"SUMIF($D$5:$BL$5,\"<=\" & 'Prosjektbeskrivelse og inndata'!$C$14,D11:BL11)","v":19875.250362795621},{"$f":"SUM(D6:D10)","v":12642.327342917019},68.582595218859552,68.582595218859552,72.625803880059564,68.582595218859552,68.582595218859552,72.625803880059564,241.1424900605796,68.582595218859552,72.625803880059564,68.582595218859552,68.582595218859552,72.625803880059564,68.582595218859552,241.1424900605796,72.625803880059564,68.582595218859552,68.582595218859552,72.625803880059564,68.582595218859552,68.582595218859552,245.1856987217796,68.582595218859552,68.582595218859552,72.625803880059564,68.582595218859552,68.582595218859552,72.625803880059564,241.1424900605796,68.582595218859552,900.93779127469884,68.582595218859552,{"$f":"SUM(AJ6:AJ10)","v":68.582595218859552},72.625803880059564,68.582595218859552,241.1424900605796,72.625803880059564,68.582595218859552,68.582595218859552,72.625803880059564,68.582595218859552,68.582595218859552,245.1856987217796,68.582595218859552,68.582595218859552,72.625803880059564,68.582595218859552,68.582595218859552,72.625803880059564,241.1424900605796,68.582595218859552,72.625803880059564,68.582595218859552,68.582595218859552,72.625803880059564,68.582595218859552,241.1424900605796,72.625803880059564,68.582595218859552,68.582595218859552,900.93779127469884]
[]
[]
[]
[]
[]
[]
[]
[]
[]
[]
[]
[]
[]
[]
[]
[]
[]
[]
[]
[]
[]
[]
[]
[]
[]
[]
[null,"Tabell 2: Utslipp fordelt på fysiske enheter og fase (i tonn CO2e)"]
[null,"Kategori","Betong","Stål","Armeringsstål","Asfalt","Frostsikring tunnel","Sprengning","Diesel","Salt","Elektrisitet","Arealbruk","Total"]
[null,"Vei i dagen",{"$f":"SUMIFS(Beregninger!M:M,Beregninger!H:H,B40,Beregninger!I:I,Resultat!C39)","v":0},{"$f":"SUMIFS(Beregninger!M:M,Beregninger!H:H,Resultat!B40,Beregninger!I:I,D39)","v":803.18733124999994},{"$f":"SUMIFS(Beregninger!M:M,Beregninger!H:H,Resultat!B40,Beregninger!I:I,E39)","v":0},{"$f":"SUMIFS(Beregninger!M:M,Beregninger!H:H,Resultat!B40,Beregninger!I:I,F39)","v":1088.4378000000002},{"$f":"SUMIFS(Beregninger!M:M,Beregninger!H:H,Resultat!B40,Beregninger!I:I,G39)","v":0},{"$f":"SUMIFS(Beregninger!M:M,Beregninger!H:H,Resultat!B40,Beregninger!I:I,H39)","v":466.95},{"$f":"SUMIFS(Beregninger!M:M,Beregninger!H:H,B40,Beregninger!I:I,I39)+SUMIFS(Beregninger!M:M,Beregninger!H:H,B40,Beregninger!I:I,Beregninger!I5)","v":2495.2266141300001},{"$f":"SUMIFS(Beregninger!M:M,Beregninger!H:H,Resultat!B40,Beregninger!I:I,J39)","v":0},{"$f":"SUMIFS(Beregninger!M:M,Beregninger!H:H,Resultat!B40,Beregninger!I:I,K39)","v":0},{"$f":"C147","v":7425.5556363636369},{"$f":"SUM(C40:L40)","v":12279.357381743637}]
[null,"Tunnel",{"$f":"SUMIFS(Beregninger!M:M,Beregninger!H:H,B41,Beregninger!I:I,Resultat!C39)","v":0},{"$f":"SUMIFS(Beregninger!M:M,Beregninger!H:H,B41,Beregninger!I:I,D39)","v":0},{"$f":"SUMIFS(Beregninger!M:M,Beregninger!H:H,B41,Beregninger!I:I,Resultat!E39)","v":0},{"$f":"SUMIFS(Beregninger!M:M,Beregninger!H:H,B41,Beregninger!I:I,F39)","v":0},{"$f":"SUMIFS(Beregninger!M:M,Beregninger!H:H,B41,Beregninger!I:I,G39)","v":0},{"$f":"SUMIFS(Beregninger!M:M,Beregninger!H:H,B41,Beregninger!I:I,H39)","v":0},{"$f":"SUMIFS(Beregninger!M:M,Beregninger!H:H,B41,Beregninger!I:I,I39)+SUMIFS(Beregninger!M:M,Beregninger!H:H,B41,Beregninger!I:I,Beregninger!I5)","v":0},{"$f":"SUMIFS(Beregninger!M:M,Beregninger!H:H,B41,Beregninger!I:I,J39)","v":0},{"$f":"SUMIFS(Beregninger!M:M,Beregninger!H:H,B41,Beregninger!I:I,K39)","v":0},0,{"$f":"SUM(C41:L41)","v":0}]
[null,"Bru",{"$f":"SUMIFS(Beregninger!M:M,Beregninger!H:H,B42,Beregninger!I:I,Resultat!C39)","v":160.65917999999999},{"$f":"SUMIFS(Beregninger!M:M,Beregninger!H:H,B42,Beregninger!I:I,D39)","v":7.1323035015},{"$f":"SUMIFS(Beregninger!M:M,Beregninger!H:H,B42,Beregninger!I:I,E39)","v":53.929176839999997},{"$f":"SUMIFS(Beregninger!M:M,Beregninger!H:H,B42,Beregninger!I:I,F39)","v":7.0422839999999995},{"$f":"SUMIFS(Beregninger!M:M,Beregninger!H:H,B42,Beregninger!I:I,G39)","v":0},{"$f":"SUMIFS(Beregninger!M:M,Beregninger!H:H,B42,Beregninger!I:I,H39)","v":0},{"$f":"SUMIFS(Beregninger!M:M,Beregninger!H:H,B42,Beregninger!I:I,I39)+SUMIFS(Beregninger!M:M,Beregninger!H:H,B42,Beregninger!I:I,Beregninger!I5)","v":6.403204014283201},{"$f":"SUMIFS(Beregninger!M:M,Beregninger!H:H,B42,Beregninger!I:I,J39)","v":0},{"$f":"SUMIFS(Beregninger!M:M,Beregninger!H:H,B42,Beregninger!I:I,K39)","v":0},0,235.16614835578318]
[null,"Kulvert",{"$f":"SUMIFS(Beregninger!M:M,Beregninger!H:H,B43,Beregninger!I:I,C39)","v":92.664000000000016},{"$f":"SUMIFS(Beregninger!M:M,Beregninger!H:H,B43,Beregninger!I:I,D39)","v":0},{"$f":"SUMIFS(Beregninger!M:M,Beregninger!H:H,B43,Beregninger!I:I,E39)","v":32.068224000000001},{"$f":"SUMIFS(Beregninger!M:M,Beregninger!H:H,B43,Beregninger!I:I,F39)","v":0},{"$f":"SUMIFS(Beregninger!M:M,Beregninger!H:H,B43,Beregninger!I:I,G39)","v":0},{"$f":"SUMIFS(Beregninger!M:M,Beregninger!H:H,B43,Beregninger!I:I,H39)","v":0},{"$f":"SUMIFS(Beregninger!M:M,Beregninger!H:H,B43,Beregninger!I:I,I39)+SUMIFS(Beregninger!M:M,Beregninger!H:H,B43,Beregninger!I:I,Beregninger!I5)","v":3.0023571455999996},{"$f":"SUMIFS(Beregninger!M:M,Beregninger!H:H,B43,Beregninger!I:I,J39)","v":0},{"$f":"SUMIFS(Beregninger!M:M,Beregninger!H:H,B43,Beregninger!I:I,K39)","v":6.9231672000000008E-2},0,127.80381281760002]
[null,"Byggefase",{"$f":"SUM(C40:C43)","v":253.32318000000001},{"$f":"SUM(D40:D43)","v":810.31963475149996},{"$f":"SUM(E40:E43)","v":85.997400839999997},1095.4800840000003,0,466.95,2504.6321752898834,0,6.9231672000000008E-2,0,{"$f":"SUM(C44:L44)","v":5216.7717065533834}]
[null,"Arealbruk",0,0,0,0,0,0,0,0,0,{"$f":"SUM(L40:L43)","v":7425.5556363636369},{"$f":"SUM(C45:L45)","v":7425.5556363636369}]
[null,"Byggefase med arealbruk",{"$f":"SUM(C40:C43)","v":253.32318000000001},810.31963475149996,85.997400839999997,1095.4800840000003,0,466.95,2504.6321752898834,0,6.9231672000000008E-2,7425.5556363636369,{"$f":"SUM(C46:L46)","v":12642.32734291702}]
[null,"Drift og vedlikehold totalt",{"$f":"SUMIF(Beregninger!$I$126:$I$311,Resultat!C39,Beregninger!$N$126:$N$311)","v":0},{"$f":"SUMIF(Beregninger!$I$126:$I$311,Resultat!D39,Beregninger!$N$126:$N$311)","v":1620.6392695029999},{"$f":"SUMIF(Beregninger!$I$126:$I$311,Resultat!E39,Beregninger!$N$126:$N$311)","v":0},{"$f":"SUMIF(Beregninger!$I$126:$I$311,Resultat!F39,Beregninger!$N$126:$N$311)","v":1338.6384972000001},{"$f":"SUMIF(Beregninger!$I$126:$I$311,Resultat!G39,Beregninger!$N$126:$N$311)","v":0},{"$f":"SUMIF(Beregninger!$I$126:$I$311,Resultat!H39,Beregninger!$N$126:$N$311)","v":0},{"$f":"SUMIF(Beregninger!$I$126:$I$311,I39,Beregninger!$N$126:$N$311)+SUMIF(Beregninger!$I$126:$I$311,Beregninger!I128,Beregninger!$N$126:$N$311)","v":871.92059317560995},{"$f":"SUMIF(Beregninger!$I$126:$I$311,Resultat!J39,Beregninger!$N$126:$N$311)","v":602.68798799999945},{"$f":"SUMIF(Beregninger!$I$126:$I$311,Resultat!K39,Beregninger!$N$126:$N$311)","v":2799.0366720000006},{"$f":"SUMIF(Beregninger!$I$126:$I$311,Resultat!L39,Beregninger!$N$126:$N$311)","v":0},7232.9230198786099]
[null,"Totalt",{"$f":"SUM(C46:C47)","v":253.32318000000001},2430.9589042544999,85.997400839999997,2434.1185812000003,0,466.95,3376.5527684654935,602.68798799999945,2799.1059036720007,7425.5556363636369,19875.250362795632]
[null,"Prosent av byggefase",{"$f":"IFERROR(C44/M44,\"Ikke relevant\")","v":4.8559376229128794E-2},{"$f":"IFERROR(D44/M44,\"Ikke relevant\")","v":0.15532970970026633},{"$f":"IFERROR(E44/M44,\"Ikke relevant\")","v":1.6484792833078899E-2},{"$f":"IFERROR(F44/M44,\"Ikke relevant\")","v":0.20999195395570838},{"$f":"IFERROR(G44/M44,\"Ikke relevant\")","v":0},{"$f":"IFERROR(H44/M44,\"Ikke relevant\")","v":8.950937979774172E-2},{"$f":"IFERROR(I44/M44,\"Ikke relevant\")","v":0.48011151650426426},{"$f":"IFERROR(J44/M44,\"Ikke relevant\")","v":0},{"$f":"IFERROR(K44/M44,\"Ikke relevant\")","v":1.3270979811715776E-5},{"$f":"IFERROR(L44/M44,\"Ikke relevant\")","v":0},{"$f":"IFERROR(SUM(C49:L49),\"Ikke relevant\")","v":1.0000000000000002}]
[null,"Prosent av d&v-fase",{"$f":"IFERROR(C47/M47,\"Ikke relevant\")","v":0},{"$f":"IFERROR(D47/M47,\"Ikke relevant\")","v":0.22406422203705398},{"$f":"IFERROR(E47/M47,\"Ikke relevant\")","v":0},{"$f":"IFERROR(F47/M47,\"Ikke relevant\")","v":0.18507572851542203},{"$f":"IFERROR(G47/M47,\"Ikke relevant\")","v":0},{"$f":"IFERROR(H47/M47,\"Ikke relevant\")","v":0},{"$f":"IFERROR(I47/M47,\"Ikke relevant\")","v":0.12054885566724079},{"$f":"IFERROR(J47/M47,\"Ikke relevant\")","v":8.3325646677505263E-2},{"$f":"IFERROR(K47/M47,\"Ikke relevant\")","v":0.38698554710277794},{"$f":"IFERROR(L47/M47,\"Ikke relevant\")","v":0},{"$f":"IFERROR(SUM(C50:L50),\"Ikke relevant\")","v":1}]
[]
[]
[]
[]
[]
[]
[]
[]
[]
[]
[]
[]
[]
[]
[]
[]
[]
[]
[]
[]
[null,null,null,null,"NB! Dersom enkelte innsatsfaktorer er så små at de ikke vises i prosentfordelingen, fjern disse fra figur ved å velge 'select data'."]
[]
[]
[]
[]
[]
[]
[]
[]
[]
[]
[]
[]
[]
[]
[]
[]
[]
[]
[]
[]
[]
[]
[]
[]
[]
[null,"Tabell 3: Direkte utslipp knyttet til diesel og sprengning (i tonn CO2e)"]
[null,"Byggefase",null,null,"Drift- og vedlikeholdsfase"]
[null,"Fjerning av vegetasjon",null,null,"Drift"]
[null,"Fjerning av vegetasjonsdekke",null,{"$f":"(Beregninger!M4)/Utslippsfaktorer!D20*Utslippsfaktorer!D19","v":56.296843199999984},"Kantklipp",null,null,{"$f":"((Beregninger!M133+Beregninger!M174)*ROUNDDOWN('Prosjektbeskrivelse og inndata'!C14/Beregningsfaktorer!D53,0))/Utslippsfaktorer!D20*Utslippsfaktorer!D19","v":2.2794858000000002}]
[null,"Anleggsarbeid knyttet til sprengning",null,{"$f":"(Beregninger!M9+Beregninger!M14)/Utslippsfaktorer!D20*Utslippsfaktorer!D19","v":144.76472999999999},"Grøfterensk og jordtransport",null,null,{"$f":"((Beregninger!M136+Beregninger!M139+Beregninger!M177+Beregninger!M180)*ROUNDDOWN('Prosjektbeskrivelse og inndata'!C14/Beregningsfaktorer!D54,0))/Utslippsfaktorer!D20*Utslippsfaktorer!D19","v":63.792676493999984}]
[null,"Sum fjerning av vegetasjon",null,{"$f":"SUM(D100:D101)","v":201.06157319999997},"Feiing",null,null,{"$f":"((Beregninger!M142+Beregninger!M183+Beregninger!M215+Beregninger!M247+Beregninger!M279+Beregninger!M299)*ROUNDDOWN('Prosjektbeskrivelse og inndata'!C14/Beregningsfaktorer!D55,0))/Utslippsfaktorer!D20*Utslippsfaktorer!D19","v":11.273174675999998}]
[null,"Transport av materialer",null,null,"Salting og salttransport",null,null,{"$f":"((Beregninger!M145+Beregninger!M149+Beregninger!M186+Beregninger!M190+Beregninger!M218+Beregninger!M222+Beregninger!M250+Beregninger!M254)*ROUNDDOWN('Prosjektbeskrivelse og inndata'!C14/Beregningsfaktorer!D56,0))/Utslippsfaktorer!D20*Utslippsfaktorer!D19","v":179.80303896719997}]
[null,"Materialer til vei i dagen",null,{"$f":"(Beregninger!M37+Beregninger!M48+Beregninger!M55)/Utslippsfaktorer!D20*Utslippsfaktorer!D19","v":37.741940527500006},"Brøyting",null,null,{"$f":"((Beregninger!M152+Beregninger!M193+Beregninger!M225+Beregninger!M257)*ROUNDDOWN('Prosjektbeskrivelse og inndata'!C14/Beregningsfaktorer!D57,0))/Utslippsfaktorer!D20*Utslippsfaktorer!D19","v":369.3028429481472}]
[null,"Materialer til bru",null,{"$f":"(Beregninger!M68+Beregninger!M82)/Utslippsfaktorer!D20*Utslippsfaktorer!D19","v":4.2713995975271999},"Sum drift",null,null,{"$f":"SUM(H100:H104)","v":626.45121888534709}]
[null,"Materialer til tunnel",null,{"$f":"(Beregninger!M96+Beregninger!M110)/Utslippsfaktorer!D20*Utslippsfaktorer!D19","v":0},"Vedlikehold"]
[null,"Materialer til kulvert",null,{"$f":"(Beregninger!M118)/Utslippsfaktorer!D20*Utslippsfaktorer!D19","v":2.3685198335999997},"Utskiftning og transport av lyktestolper",null,null,{"$f":"((Beregninger!M163+Beregninger!M204+Beregninger!M236+Beregninger!M268)*ROUNDDOWN('Prosjektbeskrivelse og inndata'!C14/Beregningsfaktorer!D52,0))/Utslippsfaktorer!D20*Utslippsfaktorer!D19","v":1.9334747144304001}]
[null,"Sum transport av materialer",null,{"$f":"SUM(D104:D107)","v":44.381859958627203},"Utskiftning og transport av autovern",null,null,{"$f":"((Beregninger!M156+Beregninger!M159+Beregninger!M197+Beregninger!M200+Beregninger!M229+Beregninger!M232+Beregninger!M261+Beregninger!M264+Beregninger!M283+Beregninger!M286+Beregninger!M303+Beregninger!M306)*ROUNDDOWN('Prosjektbeskrivelse og inndata'!C14/Beregningsfaktorer!D51,0))/Utslippsfaktorer!D20*Utslippsfaktorer!D19","v":26.454383239679998}]
[null,"Transport av masser",null,null,"Sum vedlikehold",null,null,{"$f":"SUM(H107:H108)","v":28.387857954110398}]
[null,"Jordmasser til linja",null,{"$f":"(Beregninger!M17)/Utslippsfaktorer!D20*Utslippsfaktorer!D19","v":0.67788629999999994},"Reasfaltering"]
[null,"Jordmasser deponi",null,{"$f":"(Beregninger!M20)/Utslippsfaktorer!D20*Utslippsfaktorer!D19","v":2.9052269999999996},"Utskiftning og transport av asfalt",null,null,{"$f":"((Beregninger!M127+Beregninger!M130+Beregninger!M168+Beregninger!M171+Beregninger!M209+Beregninger!M212+Beregninger!M241+Beregninger!M244+Beregninger!M273+Beregninger!M276+Beregninger!M293+Beregninger!M296)*ROUNDDOWN('Prosjektbeskrivelse og inndata'!C14/Beregningsfaktorer!D50,0))/Utslippsfaktorer!D20*Utslippsfaktorer!D19","v":33.007544368560005}]
[null,"Sprengstein til linja",null,{"$f":"(Beregninger!M23)/Utslippsfaktorer!D20*Utslippsfaktorer!D19","v":11.186365500000001},"Sum reasfaltering",null,null,{"$f":"H111","v":33.007544368560005}]
[null,"Sprengstein til deponi",null,{"$f":"(Beregninger!M26)/Utslippsfaktorer!D20*Utslippsfaktorer!D19","v":0},"Sum drift- og vedlikeholdsfase",null,null,{"$f":"H105+H109+H112","v":687.8466212080175}]
[null,"Sprengstein til linja via pukkverk",null,{"$f":"(Beregninger!M29)/Utslippsfaktorer!D20*Utslippsfaktorer!D19","v":0}]
[null,"Sum transport av masser",null,{"$f":"SUM(D110:D114)","v":14.7694788}]
[null,"Anleggsarbeid"]
[null,"Anleggsarbeid vei i dagen",null,{"$f":"(Beregninger!M40+Beregninger!M51+Beregninger!M58)/Utslippsfaktorer!D20*Utslippsfaktorer!D19","v":1714.8782736899998}]
[null,"Anleggsarbeid bru",null,{"$f":"(Beregninger!M71+Beregninger!M85)/Utslippsfaktorer!D20*Utslippsfaktorer!D19","v":0.78000334054200005}]
[null,"Anleggsarbeid tunnel",null,{"$f":"(Beregninger!M99+Beregninger!M113)/Utslippsfaktorer!D20*Utslippsfaktorer!D19","v":0}]
[null,"Anleggsarbeid kulvert",null,{"$f":"(Beregninger!M121)/Utslippsfaktorer!D20*Utslippsfaktorer!D19","v":0}]
[null,"Sum anleggsarbeid",null,{"$f":"SUM(D117:D120)","v":1715.6582770305417}]
[null,"Sprengning"]
[null,"Sprengning i dagen",null,{"$f":"Beregninger!M8","v":25.08}]
[null,"Sprengning tunnel",null,{"$f":"Beregninger!M13","v":0}]
[null,"Sum sprengning",null,{"$f":"SUM(D123:D124)","v":25.08}]
[null,"Sum byggefase",null,{"$f":"D102+D108+D115+D121+D125","v":2000.9511889891687},"Direkte utslipp fra bygging, drift og vedlikehold",null,null,{"$f":"D126+H113","v":2688.7978101971862}]
[]
[]
[]
[]
[null,"Tabell 4: Andel direkte utslipp av totale utslipp "]
[null,"Andel av byggefase ",null,{"$f":"IFERROR(D126/M44,\"Ikke relevant\")","v":0.38356119484307605}]
[null,"Andel av drift- og vedlikeholdsfase",null,{"$f":"IFERROR(H113/M47,\"Ikke relevant\")","v":9.5099397479770448E-2}]
[null,"Andel direkte utslipp",null,{"$f":"IFERROR(H126/M48,\"Ikke relevant\")","v":0.13528372026096996}]
[null,"Andel indirekte utslipp",null,{"$f":"IFERROR(1-D134,\"Ikke relevant\")","v":0.86471627973902998}]
[]
[]
[]
[null,"Tabell 6: Utslipp fra arealbruksendringer"]
[null,"Arealtype","tonn CO2e"]
[null,"Skog - lav bonitet",{"$f":"(('Prosjektbeskrivelse og inndata'!C21*'Prosjektbeskrivelse og inndata'!C24)*Utslippsfaktorer!D26)/1000","v":0}]
[null,"Skog - middels bonitet",{"$f":"(('Prosjektbeskrivelse og inndata'!C21*'Prosjektbeskrivelse og inndata'!C25)*Utslippsfaktorer!D27)/1000","v":6399.0927272727276}]
[null,"Skog - høy bonitet",{"$f":"(('Prosjektbeskrivelse og inndata'!C21*'Prosjektbeskrivelse og inndata'!C26)*Utslippsfaktorer!D28)/1000","v":0}]
[null,"Myr",{"$f":"(('Prosjektbeskrivelse og inndata'!C21*'Prosjektbeskrivelse og inndata'!C27)*Utslippsfaktorer!D29)/1000","v":0}]
[null,"Jordbruksareal",{"$f":"(('Prosjektbeskrivelse og inndata'!C21*'Prosjektbeskrivelse og inndata'!C28)*Utslippsfaktorer!D30)/1000","v":1026.4629090909091}]
[null,"Utbygd areal","-"]
[null,"Sum",{"$f":"SUM(C141:C146)","v":7425.5556363636369}]
[null,"Utbygd areal settes lik 0"]
[]
[]
[]
[]
[null,null,null,null,null,null,null,"Tabell 5: Direkte utslipp i ikke-kvotepliktig sektor"]
[null,null,null,null,null,null,null,"Byggefase",null,null,{"$f":"D102+D108+D115+D121","v":1975.8711889891688}]
[null,null,null,null,null,null,null,"Drift- og vedlikeholdsfase",null,null,{"$f":"H105+H109+H112","v":687.8466212080175}]
[null,null,null,null,null,null,null,"Sum bygge- og drift og vedlikeholdsfase",null,null,{"$f":"SUM(K154:K155)","v":2663.7178101971863}]
[null,null,null,null,null,null,null,"I denne sammenhengen er dette summen av direkte utslipp minus direkte utslipp fra sprengning."]

{"sheet":"Sensitivitetsanalyse","index":6,"n_rows":28,"n_cols":12,"rows_kept":28,"cut":false,"hidden":false,"merged":[[5,5,5,7],[5,9,5,11],[6,1,6,2],[5,1,5,3]]}
[]
[]
[null,"Sensitivitetsanalyse"]
[null,null,null,null,null,"Prosentvis endring: ",null,0.1]
[]
[null,"Opprinnelige utslipp",null,null,null,"Økning",null,null,null,"Reduksjon"]
[null,"Innsatsfaktorer",null,"Opprinnelige utslipp\n[tonn CO2e]",null,"Utslipp etter økning\n[tonn CO2e]","Ny total\n[tonn CO2e]","Økning i total\n[%]",null,"Utslipp etter reduksjon\n[tonn CO2e]","Ny total\n[tonn CO2e]","Reduksjon i total\n[%]"]
[null,"Utslipp byggefase"]
[null,"Betong",null,{"$f":"Resultat!C44","v":253.32318000000001},null,{"$f":"D9*(1+H4)","v":278.65549800000002},{"$f":"F9+SUM(D9:D18)-D9","v":5242.1040245533832},{"$f":"(G9/Resultat!M44)-1","v":4.8559376229129203E-3},null,{"$f":"D9*(1-H4)","v":227.99086200000002},{"$f":"J9+SUM(D9:D18)-D9","v":5191.4393885533827},{"$f":"(K9/Resultat!M44)-1","v":-4.8559376229130313E-3}]
[null,"Stål",null,{"$f":"Resultat!D44","v":810.31963475149996},null,{"$f":"D10*(1+H4)","v":891.35159822665003},{"$f":"F10+SUM(D9:D18)-D10","v":5297.8036700285338},{"$f":"(G10/Resultat!M44)-1","v":1.5532970970026705E-2},null,{"$f":"D10*(1-H4)","v":729.28767127635001},{"$f":"J10+SUM(D9:D18)-D10","v":5135.739743078233},{"$f":"(K10/Resultat!M44)-1","v":-1.5532970970026705E-2}]
[null,"Armeringsstål",null,{"$f":"Resultat!E44","v":85.997400839999997},null,{"$f":"D11*(1+H4)","v":94.597140924000001},{"$f":"F11+SUM(D9:D18)-D11","v":5225.3714466373831},{"$f":"(G11/Resultat!M44)-1","v":1.6484792833078021E-3},null,{"$f":"D11*(1-H4)","v":77.397660755999993},{"$f":"J11+SUM(D9:D18)-D11","v":5208.1719664693828},{"$f":"(K11/Resultat!M44)-1","v":-1.6484792833080242E-3}]
[null,"Asfalt",null,{"$f":"Resultat!F44","v":1095.4800840000003},null,{"$f":"D12*(1+H4)","v":1205.0280924000003},{"$f":"F12+SUM(D9:D18)-D12","v":5326.3197149533826},{"$f":"(G12/Resultat!M44)-1","v":2.0999195395570602E-2},null,{"$f":"D12*(1-H4)","v":985.9320756000003},{"$f":"J12+SUM(D9:D18)-D12","v":5107.2236981533842},{"$f":"(K12/Resultat!M44)-1","v":-2.0999195395570713E-2}]
[null,"Frostsikring tunnel",null,{"$f":"Resultat!G44","v":0},null,{"$f":"D13*(1+H4)","v":0},{"$f":"F13+SUM(D9:D18)-D13","v":5216.7717065533834},{"$f":"(G13/Resultat!M44)-1","v":0},null,{"$f":"D13*(1-H4)","v":0},{"$f":"J13+SUM(D9:D18)-D13","v":5216.7717065533834},{"$f":"(K13/Resultat!M44)-1","v":0}]
[null,"Sprengning",null,{"$f":"Resultat!H44","v":466.95},null,{"$f":"D14*(1+H4)","v":513.64499999999998},{"$f":"F14+SUM(D9:D18)-D14","v":5263.466706553384},{"$f":"(G14/Resultat!M44)-1","v":8.9509379797743094E-3},null,{"$f":"D14*(1-H4)","v":420.255},{"$f":"J14+SUM(D9:D18)-D14","v":5170.0767065533837},{"$f":"(K14/Resultat!M44)-1","v":-8.9509379797740873E-3}]
[null,"Diesel",null,{"$f":"Resultat!I44","v":2504.6321752898834},null,{"$f":"D15*(1+H4)","v":2755.0953928188719},{"$f":"F15+SUM(D9:D18)-D15","v":5467.2349240823714},{"$f":"(G15/Resultat!M44)-1","v":4.8011151650426465E-2},null,{"$f":"D15*(1-H4)","v":2254.168957760895},{"$f":"J15+SUM(D9:D18)-D15","v":4966.3084890243954},{"$f":"(K15/Resultat!M44)-1","v":-4.8011151650426354E-2}]
[null,"Salt",null,{"$f":"Resultat!J44","v":0},null,{"$f":"D16*(1+H4)","v":0},{"$f":"F16+SUM(D9:D18)-D16","v":5216.7717065533834},{"$f":"(G16/Resultat!M44)-1","v":0},null,{"$f":"D16*(1-H4)","v":0},{"$f":"J16+SUM(D9:D18)-D16","v":5216.7717065533834},{"$f":"(K16/Resultat!M44)-1","v":0}]
[null,"Elektrisitet",null,{"$f":"Resultat!K44","v":6.9231672000000008E-2},null,{"$f":"D17*(1+H4)","v":7.6154839200000018E-2},{"$f":"F17+SUM(D9:D18)-D17","v":5216.7786297205839},{"$f":"(G17/Resultat!M44)-1","v":1.3270979812851635E-6},null,{"$f":"D17*(1-H4)","v":6.2308504800000011E-2},{"$f":"J17+SUM(D9:D18)-D17","v":5216.7647833861838},{"$f":"(K17/Resultat!M44)-1","v":-1.3270979810631189E-6}]
[null,"Arealbruk",null,{"$f":"Resultat!L44","v":0},null,{"$f":"D18*(1+H4)","v":0},{"$f":"F18+SUM(D9:D18)-D18","v":5216.7717065533834},{"$f":"(G18/Resultat!M44)-1","v":0},null,{"$f":"D18*(1-H4)","v":0},{"$f":"J18+SUM(D9:D18)-D18","v":5216.7717065533834},{"$f":"(K18/Resultat!M44)-1","v":0}]
[null,"Utslipp driftsfase"]
[null,"Betong",null,{"$f":"Resultat!C47","v":0},null,{"$f":"D20*(1+H4)","v":0},{"$f":"F20+SUM(D20:D28)-D20","v":7232.9230198786099},{"$f":"(G20/Resultat!M47)-1","v":0},null,{"$f":"D20*(1-H4)","v":0},{"$f":"J20+SUM(D20:D28)-D20","v":7232.9230198786099},{"$f":"(K20/Resultat!M47)-1","v":0}]
[null,"Stål",null,{"$f":"Resultat!D47","v":1620.6392695029999},null,{"$f":"D21*(1+H4)","v":1782.7031964533001},{"$f":"F21+SUM(D20:D28)-D21","v":7394.9869468289098},{"$f":"(G21/Resultat!M47)-1","v":2.2406422203705478E-2},null,{"$f":"D21*(1-H4)","v":1458.5753425527},{"$f":"J21+SUM(D20:D28)-D21","v":7070.85909292831},{"$f":"(K21/Resultat!M47)-1","v":-2.2406422203705367E-2}]
[null,"Armeringsstål",null,{"$f":"Resultat!E47","v":0},null,{"$f":"D22*(1+H4)","v":0},{"$f":"F22+SUM(D20:D28)-D22","v":7232.9230198786099},{"$f":"(G22/Resultat!M47)-1","v":0},null,{"$f":"D22*(1-H4)","v":0},{"$f":"J22+SUM(D20:D28)-D22","v":7232.9230198786099},{"$f":"(K22/Resultat!M47)-1","v":0}]
[null,"Asfalt",null,{"$f":"Resultat!F47","v":1338.6384972000001},null,{"$f":"D23*(1+H4)","v":1472.5023469200003},{"$f":"F23+SUM(D20:D28)-D23","v":7366.7868695986108},{"$f":"(G23/Resultat!M47)-1","v":1.8507572851542253E-2},null,{"$f":"D23*(1-H4)","v":1204.7746474800001},{"$f":"J23+SUM(D20:D28)-D23","v":7099.0591701586109},{"$f":"(K23/Resultat!M47)-1","v":-1.8507572851542031E-2}]
[null,"Frostsikring tunnel",null,{"$f":"Resultat!G47","v":0},null,{"$f":"D24*(1+H4)","v":0},{"$f":"F24+SUM(D20:D28)-D24","v":7232.9230198786099},{"$f":"(G24/Resultat!M47)-1","v":0},null,{"$f":"D24*(1-H4)","v":0},{"$f":"J24+SUM(D20:D28)-D24","v":7232.9230198786099},{"$f":"(K24/Resultat!M47)-1","v":0}]
[null,"Sprengning",null,{"$f":"Resultat!H47","v":0},null,{"$f":"D25*(1+H4)","v":0},{"$f":"F25+SUM(D20:D28)-D25","v":7232.9230198786099},{"$f":"(G25/Resultat!M47)-1","v":0},null,{"$f":"D25*(1-H4)","v":0},{"$f":"J25+SUM(D20:D28)-D25","v":7232.9230198786099},{"$f":"(K25/Resultat!M47)-1","v":0}]
[null,"Diesel",null,{"$f":"Resultat!I47","v":871.92059317560995},null,{"$f":"D26*(1+H4)","v":959.11265249317103},{"$f":"F26+SUM(D20:D28)-D26","v":7320.1150791961718},{"$f":"(G26/Resultat!M47)-1","v":1.2054885566724183E-2},null,{"$f":"D26*(1-H4)","v":784.72853385804899},{"$f":"J26+SUM(D20:D28)-D26","v":7145.730960561049},{"$f":"(K26/Resultat!M47)-1","v":-1.2054885566724072E-2}]
[null,"Salt",null,{"$f":"Resultat!J47","v":602.68798799999945},null,{"$f":"D27*(1+H4)","v":662.95678679999946},{"$f":"F27+SUM(D20:D28)-D27","v":7293.1918186786097},{"$f":"(G27/Resultat!M47)-1","v":8.3325646677505638E-3},null,{"$f":"D27*(1-H4)","v":542.41918919999955},{"$f":"J27+SUM(D20:D28)-D27","v":7172.6542210786101},{"$f":"(K27/Resultat!M47)-1","v":-8.3325646677504528E-3}]
[null,"Elektrisitet",null,{"$f":"Resultat!K47","v":2799.0366720000006},null,{"$f":"D28*(1+H4)","v":3078.9403392000008},{"$f":"F28+SUM(D20:D28)-D28","v":7512.8266870786101},{"$f":"(G28/Resultat!M47)-1","v":3.8698554710277833E-2},null,{"$f":"D28*(1-H4)","v":2519.1330048000004},{"$f":"J28+SUM(D20:D28)-D28","v":6953.0193526786097},{"$f":"(K28/Resultat!M47)-1","v":-3.8698554710277833E-2}]

{"sheet":"Beregninger","index":7,"n_rows":311,"n_cols":74,"rows_kept":311,"cut":false,"hidden":false,"merged":[[1,0,2,1],[123,6,124,6],[123,13,124,13],[123,0,124,2]]}
[null,"Definert enhet","Summert fra\ninndata","Fysisk faktor input","Summert output","Fysisk enhet output","Livsløp","Element","Innsatstype","Tag utslippsfaktor","Utslippsfaktor","Enhet","Tonn CO2e"]
["Byggefase"]
[]
[null,"Fjerning av vegetasjonsdekke (m2)",{"$f":"SUMIF('Prosjektbeskrivelse og inndata'!$M:$M,B4,'Prosjektbeskrivelse og inndata'!$L:$L)","v":218000},"Anleggsarbeid diesel",{"$f":"C4*'Vegetasjon og arealbeslag'!F11","v":21084.959999999995},"liter diesel","År 0","Vei i dagen","Diesel",{"$f":"Utslippsfaktorer!B20","v":"Fossil diesel (WTW)"},{"$f":"SUMIF(Utslippsfaktorer!B:B,Beregninger!J4,Utslippsfaktorer!D:D)","v":3.24},{"$f":"VLOOKUP(J4,Utslippsfaktorer!B:C,2,FALSE)","v":"kg CO2e/liter"},{"$f":"(E4*K4)/1000","v":68.315270399999989}]
[null,null,null,"Anleggsarbeid biodiesel",{"$f":"C4*'Vegetasjon og arealbeslag'!G11","v":1587.04},"liter biodiesel","År 0","Vei i dagen","Biodiesel",{"$f":"Utslippsfaktorer!B18","v":"Biodiesel (WTT)"},{"$f":"SUMIF(Utslippsfaktorer!B:B,Beregninger!J5,Utslippsfaktorer!D:D)","v":1.92},{"$f":"VLOOKUP(J5,Utslippsfaktorer!B:C,2,FALSE)","v":"kg CO2e/liter"},{"$f":"(E5*K5)/1000","v":3.0471168}]
[null,null,null,"Anleggsarbeid elektrisk/hydrogen",{"$f":"C4*'Vegetasjon og arealbeslag'!H11","v":0},"kWh","År 0","Vei i dagen","Elektrisitet",{"$f":"Utslippsfaktorer!B23","v":"Elektrisitet anleggsfase, norsk miks"},{"$f":"SUMIF(Utslippsfaktorer!B:B,Beregninger!J6,Utslippsfaktorer!D:D)","v":2.6380000000000001E-2},{"$f":"VLOOKUP(J6,Utslippsfaktorer!B:C,2,FALSE)","v":"kg CO2e/kWh"},{"$f":"(E6*K6)/1000","v":0}]
[null,"Sprengning i dagen (m3)",{"$f":"SUMIF('Prosjektbeskrivelse og inndata'!$M:$M,B7,'Prosjektbeskrivelse og inndata'!$L:$L)","v":165000},"Sprengstoff (indirekte utslipp)",{"$f":"C7*Sprengning!D6","v":165000},"kg tovex","År 0","Vei i dagen","Sprengning",{"$f":"Utslippsfaktorer!B21","v":"Sprengstoff (CTG)"},{"$f":"SUMIF(Utslippsfaktorer!B:B,Beregninger!J7,Utslippsfaktorer!D:D)","v":2.6779999999999999},{"$f":"VLOOKUP(J7,Utslippsfaktorer!B:C,2,FALSE)","v":"kg CO2e/kg"},441.87]
[null,null,null,"Sprengstoff (direkte utslipp)",{"$f":"C7*Sprengning!D6","v":165000},"kg tovex","År 0","Vei i dagen","Sprengning",{"$f":"Utslippsfaktorer!B22","v":"Sprengstoff detonering"},{"$f":"SUMIF(Utslippsfaktorer!B:B,Beregninger!J8,Utslippsfaktorer!D:D)","v":0.152},{"$f":"VLOOKUP(J8,Utslippsfaktorer!B:C,2,FALSE)","v":"kg CO2e/kg"},25.08]
[null,null,null,"Anleggsarbeid diesel",{"$f":"C7*Sprengning!D15","v":54219},"liter diesel","År 0","Vei i dagen","Diesel",{"$f":"Utslippsfaktorer!B20","v":"Fossil diesel (WTW)"},{"$f":"SUMIF(Utslippsfaktorer!B:B,Beregninger!J9,Utslippsfaktorer!D:D)","v":3.24},{"$f":"VLOOKUP(J9,Utslippsfaktorer!B:C,2,FALSE)","v":"kg CO2e/liter"},175.66955999999999]
[null,null,null,"Anleggsarbeid biodiesel",{"$f":"C7*Sprengning!E15","v":4081.0000000000005},"liter biodiesel","År 0","Vei i dagen","Biodiesel",{"$f":"Utslippsfaktorer!B18","v":"Biodiesel (WTT)"},{"$f":"SUMIF(Utslippsfaktorer!B:B,Beregninger!J10,Utslippsfaktorer!D:D)","v":1.92},{"$f":"VLOOKUP(J10,Utslippsfaktorer!B:C,2,FALSE)","v":"kg CO2e/liter"},7.8355200000000007]
[null,null,null,"Anleggsarbeid elektrisk/hydrogen",{"$f":"C7*Sprengning!F15","v":0},"kWh","År 0","Vei i dagen","Elektrisitet",{"$f":"Utslippsfaktorer!B23","v":"Elektrisitet anleggsfase, norsk miks"},{"$f":"SUMIF(Utslippsfaktorer!B:B,Beregninger!J11,Utslippsfaktorer!D:D)","v":2.6380000000000001E-2},{"$f":"VLOOKUP(J11,Utslippsfaktorer!B:C,2,FALSE)","v":"kg CO2e/kWh"},0]
[null,"Sprengning tunnel (m3)",{"$f":"SUMIF('Prosjektbeskrivelse og inndata'!$M:$M,B12,'Prosjektbeskrivelse og inndata'!$L:$L)","v":0},"Sprengstoff (indirekte utslipp)",{"$f":"C12*Sprengning!D5","v":0},"kg tovex","År 0","Tunnel","Sprengning",{"$f":"Utslippsfaktorer!B21","v":"Sprengstoff (CTG)"},{"$f":"SUMIF(Utslippsfaktorer!B:B,Beregninger!J12,Utslippsfaktorer!D:D)","v":2.6779999999999999},{"$f":"VLOOKUP(J12,Utslippsfaktorer!B:C,2,FALSE)","v":"kg CO2e/kg"},0]
[null,null,null,"Sprengstoff (direkte utslipp)",{"$f":"C12*Sprengning!D5","v":0},"kg tovex","År 0","Tunnel","Sprengning",{"$f":"Utslippsfaktorer!B22","v":"Sprengstoff detonering"},{"$f":"SUMIF(Utslippsfaktorer!B:B,Beregninger!J13,Utslippsfaktorer!D:D)","v":0.152},{"$f":"VLOOKUP(J13,Utslippsfaktorer!B:C,2,FALSE)","v":"kg CO2e/kg"},0]
[null,null,null,"Anleggsarbeid diesel",{"$f":"C12*Sprengning!D15","v":0},"liter diesel","År 0","Tunnel","Diesel",{"$f":"Utslippsfaktorer!B20","v":"Fossil diesel (WTW)"},{"$f":"SUMIF(Utslippsfaktorer!B:B,Beregninger!J14,Utslippsfaktorer!D:D)","v":3.24},{"$f":"VLOOKUP(J14,Utslippsfaktorer!B:C,2,FALSE)","v":"kg CO2e/liter"},0]
[null,null,null,"Anleggsarbeid biodiesel",{"$f":"C12*Sprengning!E15","v":0},"liter biodiesel","År 0","Tunnel","Biodiesel",{"$f":"Utslippsfaktorer!B18","v":"Biodiesel (WTT)"},{"$f":"SUMIF(Utslippsfaktorer!B:B,Beregninger!J15,Utslippsfaktorer!D:D)","v":1.92},{"$f":"VLOOKUP(J15,Utslippsfaktorer!B:C,2,FALSE)","v":"kg CO2e/liter"},0]
[null,null,null,"Anleggsarbeid elektrisk/hydrogen",{"$f":"C12*Sprengning!F15","v":0},"kWh","År 0","Tunnel","Elektrisitet",{"$f":"Utslippsfaktorer!B23","v":"Elektrisitet anleggsfase, norsk miks"},{"$f":"SUMIF(Utslippsfaktorer!B:B,Beregninger!J16,Utslippsfaktorer!D:D)","v":2.6380000000000001E-2},{"$f":"VLOOKUP(J16,Utslippsfaktorer!B:C,2,FALSE)","v":"kg CO2e/kWh"},0]
[null,"Jordmasser til linja (m3)",{"$f":"SUMIF('Prosjektbeskrivelse og inndata'!$M:$M,B17,'Prosjektbeskrivelse og inndata'!$L:$L)","v":70000},"Transport diesel",{"$f":"C17*'Vegetasjon og arealbeslag'!F5","v":253.89000000000001},"liter diesel","År 0","Vei i dagen","Diesel",{"$f":"Utslippsfaktorer!B20","v":"Fossil diesel (WTW)"},{"$f":"SUMIF(Utslippsfaktorer!B:B,Beregninger!J17,Utslippsfaktorer!D:D)","v":3.24},{"$f":"VLOOKUP(J17,Utslippsfaktorer!B:C,2,FALSE)","v":"kg CO2e/liter"},0.8226036000000001]
[null,null,null,"Transport biodiesel",{"$f":"C17*'Vegetasjon og arealbeslag'!G5","v":19.110000000000003},"liter biodiesel","År 0","Vei i dagen","Biodiesel",{"$f":"Utslippsfaktorer!B18","v":"Biodiesel (WTT)"},{"$f":"SUMIF(Utslippsfaktorer!B:B,Beregninger!J18,Utslippsfaktorer!D:D)","v":1.92},{"$f":"VLOOKUP(J18,Utslippsfaktorer!B:C,2,FALSE)","v":"kg CO2e/liter"},3.66912E-2]
[null,null,null,"Transport elektrisk/hydrogen",{"$f":"C17*'Vegetasjon og arealbeslag'!H5","v":0},"kWh","År 0","Vei i dagen","Elektrisitet",{"$f":"Utslippsfaktorer!B23","v":"Elektrisitet anleggsfase, norsk miks"},{"$f":"SUMIF(Utslippsfaktorer!B:B,Beregninger!J19,Utslippsfaktorer!D:D)","v":2.6380000000000001E-2},{"$f":"VLOOKUP(J19,Utslippsfaktorer!B:C,2,FALSE)","v":"kg CO2e/kWh"},0]
[null,"Jordmasser til deponi (m3)",{"$f":"SUMIF('Prosjektbeskrivelse og inndata'!$M:$M,B20,'Prosjektbeskrivelse og inndata'!$L:$L)","v":30000},"Transport diesel",{"$f":"C20*'Vegetasjon og arealbeslag'!F6","v":1088.0999999999999},"liter diesel","År 0","Vei i dagen","Diesel",{"$f":"Utslippsfaktorer!B20","v":"Fossil diesel (WTW)"},{"$f":"SUMIF(Utslippsfaktorer!B:B,Beregninger!J20,Utslippsfaktorer!D:D)","v":3.24},{"$f":"VLOOKUP(J20,Utslippsfaktorer!B:C,2,FALSE)","v":"kg CO2e/liter"},3.5254439999999998]
[null,null,null,"Transport biodiesel",{"$f":"C20*'Vegetasjon og arealbeslag'!G6","v":81.900000000000006},"liter biodiesel","År 0","Vei i dagen","Biodiesel",{"$f":"Utslippsfaktorer!B18","v":"Biodiesel (WTT)"},{"$f":"SUMIF(Utslippsfaktorer!B:B,Beregninger!J21,Utslippsfaktorer!D:D)","v":1.92},{"$f":"VLOOKUP(J21,Utslippsfaktorer!B:C,2,FALSE)","v":"kg CO2e/liter"},0.15724800000000003]
[null,null,null,"Transport elektrisk/hydrogen",{"$f":"C20*'Vegetasjon og arealbeslag'!H6","v":0},"kWh","År 0","Vei i dagen","Elektrisitet",{"$f":"Utslippsfaktorer!B23","v":"Elektrisitet anleggsfase, norsk miks"},{"$f":"SUMIF(Utslippsfaktorer!B:B,Beregninger!J22,Utslippsfaktorer!D:D)","v":2.6380000000000001E-2},{"$f":"VLOOKUP(J22,Utslippsfaktorer!B:C,2,FALSE)","v":"kg CO2e/kWh"},0]
[null,"Sprengstein til linja (m3)",{"$f":"SUMIF('Prosjektbeskrivelse og inndata'!$M:$M,B23,'Prosjektbeskrivelse og inndata'!$L:$L)","v":170000},"Transport diesel",{"$f":"C23*Sprengning!F7","v":4189.6499999999996},"liter diesel","År 0","Vei i dagen","Diesel",{"$f":"Utslippsfaktorer!B20","v":"Fossil diesel (WTW)"},{"$f":"SUMIF(Utslippsfaktorer!B:B,Beregninger!J23,Utslippsfaktorer!D:D)","v":3.24},{"$f":"VLOOKUP(J23,Utslippsfaktorer!B:C,2,FALSE)","v":"kg CO2e/liter"},13.574466000000001]
[null,null,null,"Transport biodiesel",{"$f":"C23*Sprengning!G7","v":315.35000000000002},"liter biodiesel","År 0","Vei i dagen","Biodiesel",{"$f":"Utslippsfaktorer!B18","v":"Biodiesel (WTT)"},{"$f":"SUMIF(Utslippsfaktorer!B:B,Beregninger!J24,Utslippsfaktorer!D:D)","v":1.92},{"$f":"VLOOKUP(J24,Utslippsfaktorer!B:C,2,FALSE)","v":"kg CO2e/liter"},0.60547200000000001]
[null,null,null,"Transport elektrisk/hydrogen",{"$f":"C23*Sprengning!H7","v":0},"kWh","År 0","Vei i dagen","Elektrisitet",{"$f":"Utslippsfaktorer!B23","v":"Elektrisitet anleggsfase, norsk miks"},{"$f":"SUMIF(Utslippsfaktorer!B:B,Beregninger!J25,Utslippsfaktorer!D:D)","v":2.6380000000000001E-2},{"$f":"VLOOKUP(J25,Utslippsfaktorer!B:C,2,FALSE)","v":"kg CO2e/kWh"},0]
[null,"Sprengstein til deponi (m3)",{"$f":"SUMIF('Prosjektbeskrivelse og inndata'!$M:$M,B26,'Prosjektbeskrivelse og inndata'!$L:$L)","v":0},"Transport diesel",{"$f":"C26*Sprengning!F8","v":0},"liter diesel","År 0","Vei i dagen","Diesel",{"$f":"Utslippsfaktorer!B20","v":"Fossil diesel (WTW)"},{"$f":"SUMIF(Utslippsfaktorer!B:B,Beregninger!J26,Utslippsfaktorer!D:D)","v":3.24},{"$f":"VLOOKUP(J26,Utslippsfaktorer!B:C,2,FALSE)","v":"kg CO2e/liter"},0]
[null,null,null,"Transport biodiesel",{"$f":"C26*Sprengning!G8","v":0},"liter biodiesel","År 0","Vei i dagen","Biodiesel",{"$f":"Utslippsfaktorer!B18","v":"Biodiesel (WTT)"},{"$f":"SUMIF(Utslippsfaktorer!B:B,Beregninger!J27,Utslippsfaktorer!D:D)","v":1.92},{"$f":"VLOOKUP(J27,Utslippsfaktorer!B:C,2,FALSE)","v":"kg CO2e/liter"},0]
[null,null,null,"Transport elektrisk/hydrogen",{"$f":"C26*Sprengning!H8","v":0},"kWh","År 0","Vei i dagen","Elektrisitet",{"$f":"Utslippsfaktorer!B23","v":"Elektrisitet anleggsfase, norsk miks"},{"$f":"SUMIF(Utslippsfaktorer!B:B,Beregninger!J28,Utslippsfaktorer!D:D)","v":2.6380000000000001E-2},{"$f":"VLOOKUP(J28,Utslippsfaktorer!B:C,2,FALSE)","v":"kg CO2e/kWh"},0]
[null,"Sprengstein til linja via pukkverk (m3)",{"$f":"SUMIF('Prosjektbeskrivelse og inndata'!$M:$M,B29,'Prosjektbeskrivelse og inndata'!$L:$L)","v":0},"Transport diesel",{"$f":"C29*Sprengning!F9","v":0},"liter diesel","År 0","Vei i dagen","Diesel",{"$f":"Utslippsfaktorer!B20","v":"Fossil diesel (WTW)"},{"$f":"SUMIF(Utslippsfaktorer!B:B,Beregninger!J29,Utslippsfaktorer!D:D)","v":3.24},{"$f":"VLOOKUP(J29,Utslippsfaktorer!B:C,2,FALSE)","v":"kg CO2e/liter"},0]
[null,null,null,"Transport biodiesel",{"$f":"C29*Sprengning!G9","v":0},"liter biodiesel","År 0","Vei i dagen","Biodiesel",{"$f":"Utslippsfaktorer!B18","v":"Biodiesel (WTT)"},{"$f":"SUMIF(Utslippsfaktorer!B:B,Beregninger!J30,Utslippsfaktorer!D:D)","v":1.92},{"$f":"VLOOKUP(J30,Utslippsfaktorer!B:C,2,FALSE)","v":"kg CO2e/liter"},0]
[null,null,null,"Transport elektrisk/hydrogen",{"$f":"C29*Sprengning!H9","v":0},"kWh","År 0","Vei i dagen","Elektrisitet",{"$f":"Utslippsfaktorer!B23","v":"Elektrisitet anleggsfase, norsk miks"},{"$f":"SUMIF(Utslippsfaktorer!B:B,Beregninger!J31,Utslippsfaktorer!D:D)","v":2.6380000000000001E-2},{"$f":"VLOOKUP(J31,Utslippsfaktorer!B:C,2,FALSE)","v":"kg CO2e/kWh"},0]
[null,"Hovedvei (m)",{"$f":"SUMIF('Prosjektbeskrivelse og inndata'!$M:$M,B32,'Prosjektbeskrivelse og inndata'!$L:$L)","v":4700},"Slitelag skjelettasfalt (Ska)",{"$f":"C32*Hovedvei!D5*'Prosjektbeskrivelse og inndata'!C9","v":3965625},"kg skjelettasfalt","År 0","Vei i dagen","Asfalt",{"$f":"Utslippsfaktorer!B7","v":"Skjelettasfalt (Ska)"},{"$f":"SUMIF(Utslippsfaktorer!B:B,Beregninger!J32,Utslippsfaktorer!D:D)","v":6.5699999999999995E-2},{"$f":"VLOOKUP(J32,Utslippsfaktorer!B:C,2,FALSE)","v":"kg CO2e/kg"},{"$f":"(E32*K32)/1000","v":260.5415625}]
[null,null,null,"Bindlag skjelettasfalt (Ska)",{"$f":"C32*Hovedvei!D6*'Prosjektbeskrivelse og inndata'!C9","v":3084375.0000000005},"kg skjelettasfalt","År 0","Vei i dagen","Asfalt",{"$f":"Utslippsfaktorer!B7","v":"Skjelettasfalt (Ska)"},{"$f":"SUMIF(Utslippsfaktorer!B:B,Beregninger!J33,Utslippsfaktorer!D:D)","v":6.5699999999999995E-2},{"$f":"VLOOKUP(J33,Utslippsfaktorer!B:C,2,FALSE)","v":"kg CO2e/kg"},202.6434375]
[null,null,null,"Bærelag asfaltgrus (Ag)",{"$f":"C32*Hovedvei!D7*'Prosjektbeskrivelse og inndata'!C9","v":10998000},"kg asfaltgrus","År 0","Vei i dagen","Asfalt",{"$f":"Utslippsfaktorer!B8","v":"Asfaltgrus (Ag)"},{"$f":"SUMIF(Utslippsfaktorer!B:B,Beregninger!J34,Utslippsfaktorer!D:D)","v":4.8800000000000003E-2},{"$f":"VLOOKUP(J34,Utslippsfaktorer!B:C,2,FALSE)","v":"kg CO2e/kg"},536.70240000000001]
[null,null,null,"Lyktestolper",{"$f":"C32*'Tillegg vei'!D5*Beregningsfaktorer!D81","v":45343.250000000007},"kg stål","År 0","Vei i dagen","Stål",{"$f":"Utslippsfaktorer!B14","v":"Stål"},{"$f":"SUMIF(Utslippsfaktorer!B:B,Beregninger!J35,Utslippsfaktorer!D:D)","v":2.1234999999999999},{"$f":"VLOOKUP(J35,Utslippsfaktorer!B:C,2,FALSE)","v":"kg CO2e/kg"},96.286391375000008]
[null,null,null,"Autovern/rekkverk",{"$f":"C32*'Tillegg vei'!D7*Beregningsfaktorer!D83","v":310200},"kg stål","År 0","Vei i dagen","Stål",{"$f":"Utslippsfaktorer!B14","v":"Stål"},{"$f":"SUMIF(Utslippsfaktorer!B:B,Beregninger!J36,Utslippsfaktorer!D:D)","v":2.1234999999999999},{"$f":"VLOOKUP(J36,Utslippsfaktorer!B:C,2,FALSE)","v":"kg CO2e/kg"},658.7097]
[null,null,null,"Transport diesel",{"$f":"C32*(((SUM(Hovedvei!E5:E7)*'Prosjektbeskrivelse og inndata'!C9)+(('Tillegg vei'!E5*Beregningsfaktorer!D81)+('Tillegg vei'!E7*Beregningsfaktorer!D83))))","v":12716.025780000002},"liter diesel","År 0","Vei i dagen","Diesel",{"$f":"Utslippsfaktorer!B20","v":"Fossil diesel (WTW)"},{"$f":"SUMIF(Utslippsfaktorer!B:B,Beregninger!J37,Utslippsfaktorer!D:D)","v":3.24},{"$f":"VLOOKUP(J37,Utslippsfaktorer!B:C,2,FALSE)","v":"kg CO2e/liter"},41.199923527200006]
[null,null,null,"Transport biodiesel",{"$f":"C32*(((SUM(Hovedvei!F5:F7)*'Prosjektbeskrivelse og inndata'!C9)+(('Tillegg vei'!F5*Beregningsfaktorer!D81)+('Tillegg vei'!F7*Beregningsfaktorer!D83))))","v":957.12022000000002},"liter biodiesel","År 0","Vei i dagen","Biodiesel",{"$f":"Utslippsfaktorer!B18","v":"Biodiesel (WTT)"},{"$f":"SUMIF(Utslippsfaktorer!B:B,Beregninger!J38,Utslippsfaktorer!D:D)","v":1.92},{"$f":"VLOOKUP(J38,Utslippsfaktorer!B:C,2,FALSE)","v":"kg CO2e/liter"},1.8376708224]
[null,null,null,"Transport elektrisk/hydrogen",{"$f":"C32*(((SUM(Hovedvei!G5:G7)*'Prosjektbeskrivelse og inndata'!C9)+(('Tillegg vei'!G5*Beregningsfaktorer!D81)+('Tillegg vei'!G7*Beregningsfaktorer!D83))))","v":0},"kWh","År 0","Vei i dagen","Elektrisitet",{"$f":"Utslippsfaktorer!B23","v":"Elektrisitet anleggsfase, norsk miks"},{"$f":"SUMIF(Utslippsfaktorer!B:B,Beregninger!J39,Utslippsfaktorer!D:D)","v":2.6380000000000001E-2},{"$f":"VLOOKUP(J39,Utslippsfaktorer!B:C,2,FALSE)","v":"kg CO2e/kWh"},0]
[null,null,null,"Anleggsarbeid diesel",{"$f":"C32*(((SUM(Hovedvei!E15:E28)*'Prosjektbeskrivelse og inndata'!C9)+(('Tillegg vei'!D12*Beregningsfaktorer!D83)+('Tillegg vei'!D13*Beregningsfaktorer!D87)+('Tillegg vei'!D14*Beregningsfaktorer!D85))))","v":591956.22509999992},"liter diesel","År 0","Vei i dagen","Diesel",{"$f":"Utslippsfaktorer!B20","v":"Fossil diesel (WTW)"},{"$f":"SUMIF(Utslippsfaktorer!B:B,Beregninger!J40,Utslippsfaktorer!D:D)","v":3.24},{"$f":"VLOOKUP(J40,Utslippsfaktorer!B:C,2,FALSE)","v":"kg CO2e/liter"},1917.938169324]
[null,null,null,"Anleggsarbeid biodiesel",{"$f":"C32*(((SUM(Hovedvei!F15:F28)*'Prosjektbeskrivelse og inndata'!C9)+(('Tillegg vei'!E12*Beregningsfaktorer!D83)+('Tillegg vei'!E13*Beregningsfaktorer!D87)+('Tillegg vei'!E14*Beregningsfaktorer!D85))))","v":44555.844900000004},"liter biodiesel","År 0","Vei i dagen","Biodiesel",{"$f":"Utslippsfaktorer!B18","v":"Biodiesel (WTT)"},{"$f":"SUMIF(Utslippsfaktorer!B:B,Beregninger!J41,Utslippsfaktorer!D:D)","v":1.92},{"$f":"VLOOKUP(J41,Utslippsfaktorer!B:C,2,FALSE)","v":"kg CO2e/liter"},85.547222208000008]
[null,null,null,"Anleggsarbeid elektrisk/hydrogen",{"$f":"C32*(((SUM(Hovedvei!G15:G28)*'Prosjektbeskrivelse og inndata'!C9)+(('Tillegg vei'!F12*Beregningsfaktorer!D83)+('Tillegg vei'!F13*Beregningsfaktorer!D87)+('Tillegg vei'!F14*Beregningsfaktorer!D85))))","v":0},"kWh","År 0","Vei i dagen","Elektrisitet",{"$f":"Utslippsfaktorer!B23","v":"Elektrisitet anleggsfase, norsk miks"},{"$f":"SUMIF(Utslippsfaktorer!B:B,Beregninger!J42,Utslippsfaktorer!D:D)","v":2.6380000000000001E-2},{"$f":"VLOOKUP(J42,Utslippsfaktorer!B:C,2,FALSE)","v":"kg CO2e/kWh"},0]
[null,"Sidevei (m)",{"$f":"SUMIF('Prosjektbeskrivelse og inndata'!$M:$M,B43,'Prosjektbeskrivelse og inndata'!$L:$L)","v":600},"Slitelag asfaltgrusbetong (Agb)",{"$f":"C43*Sidevei!D5*'Prosjektbeskrivelse og inndata'!C10","v":303750},"kg asfaltgrusbetong","År 0","Vei i dagen","Asfalt",{"$f":"Utslippsfaktorer!B6","v":"Asfaltgrusbetong (Agb)"},{"$f":"SUMIF(Utslippsfaktorer!B:B,Beregninger!J43,Utslippsfaktorer!D:D)","v":5.1200000000000002E-2},{"$f":"VLOOKUP(J43,Utslippsfaktorer!B:C,2,FALSE)","v":"kg CO2e/kg"},15.552]
[null,null,null,"Bindlag asfaltgrusbetong (Agb)",{"$f":"C43*Sidevei!D6*'Prosjektbeskrivelse og inndata'!C10","v":236250.00000000003},"kg asfaltgrusbetong","År 0","Vei i dagen","Asfalt",{"$f":"Utslippsfaktorer!B6","v":"Asfaltgrusbetong (Agb)"},{"$f":"SUMIF(Utslippsfaktorer!B:B,Beregninger!J44,Utslippsfaktorer!D:D)","v":5.1200000000000002E-2},{"$f":"VLOOKUP(J44,Utslippsfaktorer!B:C,2,FALSE)","v":"kg CO2e/kg"},12.096000000000002]
[null,null,null,"Bærelag asfaltgrus (Ag)",{"$f":"C43*Sidevei!D7*'Prosjektbeskrivelse og inndata'!C10","v":842400},"kg asfaltgrus","År 0","Vei i dagen","Asfalt",{"$f":"Utslippsfaktorer!B8","v":"Asfaltgrus (Ag)"},{"$f":"SUMIF(Utslippsfaktorer!B:B,Beregninger!J45,Utslippsfaktorer!D:D)","v":4.8800000000000003E-2},{"$f":"VLOOKUP(J45,Utslippsfaktorer!B:C,2,FALSE)","v":"kg CO2e/kg"},41.109120000000004]
[null,null,null,"Lyktestolper",{"$f":"C43*'Tillegg vei'!D6*Beregningsfaktorer!D82","v":2894.2500000000005},"kg stål","År 0","Vei i dagen","Stål",{"$f":"Utslippsfaktorer!B14","v":"Stål"},{"$f":"SUMIF(Utslippsfaktorer!B:B,Beregninger!J46,Utslippsfaktorer!D:D)","v":2.1234999999999999},{"$f":"VLOOKUP(J46,Utslippsfaktorer!B:C,2,FALSE)","v":"kg CO2e/kg"},6.1459398750000007]
[null,null,null,"Autovern/rekkverk",{"$f":"C43*'Tillegg vei'!D7*Beregningsfaktorer!D84","v":19800},"kg stål","År 0","Vei i dagen","Stål",{"$f":"Utslippsfaktorer!B14","v":"Stål"},{"$f":"SUMIF(Utslippsfaktorer!B:B,Beregninger!J47,Utslippsfaktorer!D:D)","v":2.1234999999999999},{"$f":"VLOOKUP(J47,Utslippsfaktorer!B:C,2,FALSE)","v":"kg CO2e/kg"},42.045299999999997]
[null,null,null,"Transport diesel",{"$f":"C43*(((SUM(Sidevei!E5:E7)*'Prosjektbeskrivelse og inndata'!C10)+(('Tillegg vei'!E6*Beregningsfaktorer!D82)+('Tillegg vei'!E7*Beregningsfaktorer!D84))))","v":940.22442000000012},"liter diesel","År 0","Vei i dagen","Diesel",{"$f":"Utslippsfaktorer!B20","v":"Fossil diesel (WTW)"},{"$f":"SUMIF(Utslippsfaktorer!B:B,Beregninger!J48,Utslippsfaktorer!D:D)","v":3.24},{"$f":"VLOOKUP(J48,Utslippsfaktorer!B:C,2,FALSE)","v":"kg CO2e/liter"},3.0463271208000005]
[null,null,null,"Transport biodiesel",{"$f":"C43*(((SUM(Sidevei!F5:F7)*'Prosjektbeskrivelse og inndata'!C10)+(('Tillegg vei'!F6*Beregningsfaktorer!D82)+('Tillegg vei'!F7*Beregningsfaktorer!D84))))","v":70.769580000000005},"liter biodiesel","År 0","Vei i dagen","Biodiesel",{"$f":"Utslippsfaktorer!B18","v":"Biodiesel (WTT)"},{"$f":"SUMIF(Utslippsfaktorer!B:B,Beregninger!J49,Utslippsfaktorer!D:D)","v":1.92},{"$f":"VLOOKUP(J49,Utslippsfaktorer!B:C,2,FALSE)","v":"kg CO2e/liter"},0.13587759360000001]
[null,null,null,"Transport elektrisk/hydrogen",{"$f":"C43*(((SUM(Sidevei!G5:G7)*'Prosjektbeskrivelse og inndata'!C10)+(('Tillegg vei'!G6*Beregningsfaktorer!D82)+('Tillegg vei'!G7*Beregningsfaktorer!D84))))","v":0},"kWh","År 0","Vei i dagen","Elektrisitet",{"$f":"Utslippsfaktorer!B23","v":"Elektrisitet anleggsfase, norsk miks"},{"$f":"SUMIF(Utslippsfaktorer!B:B,Beregninger!J50,Utslippsfaktorer!D:D)","v":2.6380000000000001E-2},{"$f":"VLOOKUP(J50,Utslippsfaktorer!B:C,2,FALSE)","v":"kg CO2e/kWh"},0]
[null,null,null,"Anleggsarbeid diesel",{"$f":"C43*(((SUM(Sidevei!E15:E28)*'Prosjektbeskrivelse og inndata'!C10)+(('Tillegg vei'!D12*Beregningsfaktorer!D84)+('Tillegg vei'!D13*Beregningsfaktorer!D88)+('Tillegg vei'!D14*Beregningsfaktorer!D86))))","v":49716.047879999998},"liter diesel","År 0","Vei i dagen","Diesel",{"$f":"Utslippsfaktorer!B20","v":"Fossil diesel (WTW)"},{"$f":"SUMIF(Utslippsfaktorer!B:B,Beregninger!J51,Utslippsfaktorer!D:D)","v":3.24},{"$f":"VLOOKUP(J51,Utslippsfaktorer!B:C,2,FALSE)","v":"kg CO2e/liter"},161.07999513120001]
[null,null,null,"Anleggsarbeid biodiesel",{"$f":"C43*(((SUM(Sidevei!F15:F28)*'Prosjektbeskrivelse og inndata'!C10)+(('Tillegg vei'!E12*Beregningsfaktorer!D84)+('Tillegg vei'!E13*Beregningsfaktorer!D88)+('Tillegg vei'!E14*Beregningsfaktorer!D86))))","v":3742.0681199999999},"liter biodiesel","År 0","Vei i dagen","Biodiesel",{"$f":"Utslippsfaktorer!B18","v":"Biodiesel (WTT)"},{"$f":"SUMIF(Utslippsfaktorer!B:B,Beregninger!J52,Utslippsfaktorer!D:D)","v":1.92},{"$f":"VLOOKUP(J52,Utslippsfaktorer!B:C,2,FALSE)","v":"kg CO2e/liter"},7.1847707904]
[null,null,null,"Anleggsarbeid elektrisk/hydrogen",{"$f":"C43*(((SUM(Sidevei!G15:G28)*'Prosjektbeskrivelse og inndata'!C10)+(('Tillegg vei'!F12*Beregningsfaktorer!D84)+('Tillegg vei'!F13*Beregningsfaktorer!D88)+('Tillegg vei'!F14*Beregningsfaktorer!D86))))","v":0},"kWh","År 0","Vei i dagen","Elektrisitet",{"$f":"Utslippsfaktorer!B23","v":"Elektrisitet anleggsfase, norsk miks"},{"$f":"SUMIF(Utslippsfaktorer!B:B,Beregninger!J53,Utslippsfaktorer!D:D)","v":2.6380000000000001E-2},{"$f":"VLOOKUP(J53,Utslippsfaktorer!B:C,2,FALSE)","v":"kg CO2e/kWh"},0]
[null,"Anleggsvei (m)",{"$f":"SUMIF('Prosjektbeskrivelse og inndata'!$M:$M,B54,'Prosjektbeskrivelse og inndata'!$L:$L)","v":200},"Bærelag asfaltgrus (Ag)",{"$f":"C54*Anleggsvei!D5*'Prosjektbeskrivelse og inndata'!C11","v":405600},"kg asfaltgrus","År 0","Vei i dagen","Asfalt",{"$f":"Utslippsfaktorer!B8","v":"Asfaltgrus (Ag)"},{"$f":"SUMIF(Utslippsfaktorer!B:B,Beregninger!J54,Utslippsfaktorer!D:D)","v":4.8800000000000003E-2},{"$f":"VLOOKUP(J54,Utslippsfaktorer!B:C,2,FALSE)","v":"kg CO2e/kg"},19.793280000000003]
[null,null,null,"Transport diesel",{"$f":"C54*(SUM(Anleggsvei!E5:E6)*'Prosjektbeskrivelse og inndata'!C11)","v":479.30805000000004},"liter diesel","År 0","Vei i dagen","Diesel",{"$f":"Utslippsfaktorer!B20","v":"Fossil diesel (WTW)"},{"$f":"SUMIF(Utslippsfaktorer!B:B,Beregninger!J55,Utslippsfaktorer!D:D)","v":3.24},{"$f":"VLOOKUP(J55,Utslippsfaktorer!B:C,2,FALSE)","v":"kg CO2e/liter"},1.5529580820000004]
[null,null,null,"Transport biodiesel",{"$f":"C54*(SUM(Anleggsvei!F5:F6)*'Prosjektbeskrivelse og inndata'!C11)","v":36.076950000000011},"liter biodiesel","År 0","Vei i dagen","Biodiesel",{"$f":"Utslippsfaktorer!B18","v":"Biodiesel (WTT)"},{"$f":"SUMIF(Utslippsfaktorer!B:B,Beregninger!J56,Utslippsfaktorer!D:D)","v":1.92},{"$f":"VLOOKUP(J56,Utslippsfaktorer!B:C,2,FALSE)","v":"kg CO2e/liter"},6.926774400000002E-2]
[null,null,null,"Transport elektrisk/hydrogen",{"$f":"C54*(SUM(Anleggsvei!G5:G6)*'Prosjektbeskrivelse og inndata'!C11)","v":0},"kWh","År 0","Vei i dagen","Elektrisitet",{"$f":"Utslippsfaktorer!B23","v":"Elektrisitet anleggsfase, norsk miks"},{"$f":"SUMIF(Utslippsfaktorer!B:B,Beregninger!J57,Utslippsfaktorer!D:D)","v":2.6380000000000001E-2},{"$f":"VLOOKUP(J57,Utslippsfaktorer!B:C,2,FALSE)","v":"kg CO2e/kWh"},0]
[null,null,null,"Anleggsarbeid diesel",{"$f":"C54*(SUM(Anleggsvei!E12:E16)*'Prosjektbeskrivelse og inndata'!C11)","v":604.23401999999999},"liter diesel","År 0","Vei i dagen","Diesel",{"$f":"Utslippsfaktorer!B20","v":"Fossil diesel (WTW)"},{"$f":"SUMIF(Utslippsfaktorer!B:B,Beregninger!J58,Utslippsfaktorer!D:D)","v":3.24},{"$f":"VLOOKUP(J58,Utslippsfaktorer!B:C,2,FALSE)","v":"kg CO2e/liter"},1.9577182248000002]
[null,null,null,"Anleggsarbeid biodiesel",{"$f":"C54*(SUM(Anleggsvei!F12:F16)*'Prosjektbeskrivelse og inndata'!C11)","v":45.479980000000012},"liter biodiesel","År 0","Vei i dagen","Biodiesel",{"$f":"Utslippsfaktorer!B18","v":"Biodiesel (WTT)"},{"$f":"SUMIF(Utslippsfaktorer!B:B,Beregninger!J59,Utslippsfaktorer!D:D)","v":1.92},{"$f":"VLOOKUP(J59,Utslippsfaktorer!B:C,2,FALSE)","v":"kg CO2e/liter"},8.7321561600000028E-2]
[null,null,null,"Anleggsarbeid elektrisk/hydrogen",{"$f":"C54*(SUM(Anleggsvei!G12:G16)*'Prosjektbeskrivelse og inndata'!C11)","v":0},"kWh","År 0","Vei i dagen","Elektrisitet",{"$f":"Utslippsfaktorer!B23","v":"Elektrisitet anleggsfase, norsk miks"},{"$f":"SUMIF(Utslippsfaktorer!B:B,Beregninger!J60,Utslippsfaktorer!D:D)","v":2.6380000000000001E-2},{"$f":"VLOOKUP(J60,Utslippsfaktorer!B:C,2,FALSE)","v":"kg CO2e/kWh"},0]
[null,"Betongbru (m)",{"$f":"SUMIF('Prosjektbeskrivelse og inndata'!$M:$M,B61,'Prosjektbeskrivelse og inndata'!$L:$L)","v":44.4},"Betong",{"$f":"C61*Betongbru!E5*'Prosjektbeskrivelse og inndata'!C12","v":1168430.3999999999},"kg betong","År 0","Bru","Betong",{"$f":"Utslippsfaktorer!B10","v":"Betong"},{"$f":"SUMIF(Utslippsfaktorer!B:B,Beregninger!J61,Utslippsfaktorer!D:D)","v":0.13750000000000001},{"$f":"VLOOKUP(J61,Utslippsfaktorer!B:C,2,FALSE)","v":"kg CO2e/kg"},160.65917999999999]
[null,null,null,"Armeringsstål",{"$f":"C61*Betongbru!E6*'Prosjektbeskrivelse og inndata'!C12","v":87179.4},"kg armeringsstål","År 0","Bru","Armeringsstål",{"$f":"Utslippsfaktorer!B5","v":"Armeringsstål"},{"$f":"SUMIF(Utslippsfaktorer!B:B,Beregninger!J62,Utslippsfaktorer!D:D)","v":0.61860000000000004},{"$f":"VLOOKUP(J62,Utslippsfaktorer!B:C,2,FALSE)","v":"kg CO2e/kg"},53.929176839999997]
[null,null,null,"Slitelag skjelettasfalt (Ska)",{"$f":"C61*Betongbru!E7*'Prosjektbeskrivelse og inndata'!C12","v":42457.5},"kg skjelettasfalt","År 0","Bru","Asfalt",{"$f":"Utslippsfaktorer!B7","v":"Skjelettasfalt (Ska)"},{"$f":"SUMIF(Utslippsfaktorer!B:B,Beregninger!J63,Utslippsfaktorer!D:D)","v":6.5699999999999995E-2},{"$f":"VLOOKUP(J63,Utslippsfaktorer!B:C,2,FALSE)","v":"kg CO2e/kg"},2.7894577499999995]
[null,null,null,"Bindlag skjelettasfalt (Ska)",{"$f":"C61*Betongbru!E8*'Prosjektbeskrivelse og inndata'!C12","v":33022.500000000007},"kg skjelettasfalt","År 0","Bru","Asfalt",{"$f":"Utslippsfaktorer!B7","v":"Skjelettasfalt (Ska)"},{"$f":"SUMIF(Utslippsfaktorer!B:B,Beregninger!J64,Utslippsfaktorer!D:D)","v":6.5699999999999995E-2},{"$f":"VLOOKUP(J64,Utslippsfaktorer!B:C,2,FALSE)","v":"kg CO2e/kg"},2.1695782500000003]
[null,null,null,"Fuktisolering (Topeka)",{"$f":"C61*Betongbru!E9*'Prosjektbeskrivelse og inndata'!C12","v":11322},"kg topeka","År 0","Bru","Asfalt",{"$f":"Utslippsfaktorer!B9","v":"Topeka"},{"$f":"SUMIF(Utslippsfaktorer!B:B,Beregninger!J65,Utslippsfaktorer!D:D)","v":0.184},{"$f":"VLOOKUP(J65,Utslippsfaktorer!B:C,2,FALSE)","v":"kg CO2e/kg"},2.0832480000000002]
[null,null,null,"Lyktestolper",{"$f":"C61*'Tillegg vei'!D5*Beregningsfaktorer!D81","v":428.34900000000005},"kg stål","År 0","Bru","Stål",{"$f":"Utslippsfaktorer!B14","v":"Stål"},{"$f":"SUMIF(Utslippsfaktorer!B:B,Beregninger!J66,Utslippsfaktorer!D:D)","v":2.1234999999999999},{"$f":"VLOOKUP(J66,Utslippsfaktorer!B:C,2,FALSE)","v":"kg CO2e/kg"},0.90959910150000012]
[null,null,null,"Autovern/rekkverk",{"$f":"C61*'Tillegg vei'!D7*Beregningsfaktorer!D83","v":2930.4},"kg stål","År 0","Bru","Stål",{"$f":"Utslippsfaktorer!B14","v":"Stål"},{"$f":"SUMIF(Utslippsfaktorer!B:B,Beregninger!J67,Utslippsfaktorer!D:D)","v":2.1234999999999999},{"$f":"VLOOKUP(J67,Utslippsfaktorer!B:C,2,FALSE)","v":"kg CO2e/kg"},6.2227043999999996]
[null,null,null,"Transport diesel",{"$f":"C61*(((SUM(Betongbru!F5:F9)*'Prosjektbeskrivelse og inndata'!C12)+(('Tillegg vei'!E5*Beregningsfaktorer!D81)+('Tillegg vei'!E7*Beregningsfaktorer!D83))))","v":1599.7751301599999},"liter diesel","År 0","Bru","Diesel",{"$f":"Utslippsfaktorer!B20","v":"Fossil diesel (WTW)"},{"$f":"SUMIF(Utslippsfaktorer!B:B,Beregninger!J68,Utslippsfaktorer!D:D)","v":3.24},{"$f":"VLOOKUP(J68,Utslippsfaktorer!B:C,2,FALSE)","v":"kg CO2e/liter"},5.1832714217184002]
[null,null,null,"Transport biodiesel",{"$f":"C61*(((SUM(Betongbru!G5:G9)*'Prosjektbeskrivelse og inndata'!C12)+(('Tillegg vei'!F5*Beregningsfaktorer!D81)+('Tillegg vei'!F7*Beregningsfaktorer!D83))))","v":120.41318183999999},"liter biodiesel","År 0","Bru","Biodiesel",{"$f":"Utslippsfaktorer!B18","v":"Biodiesel (WTT)"},{"$f":"SUMIF(Utslippsfaktorer!B:B,Beregninger!J69,Utslippsfaktorer!D:D)","v":1.92},{"$f":"VLOOKUP(J69,Utslippsfaktorer!B:C,2,FALSE)","v":"kg CO2e/liter"},0.23119330913279998]
[null,null,null,"Transport elektrisk/hydrogen",{"$f":"C61*(((SUM(Betongbru!H5:H9)*'Prosjektbeskrivelse og inndata'!C12)+(('Tillegg vei'!G5*Beregningsfaktorer!D81)+('Tillegg vei'!G7*Beregningsfaktorer!D83))))","v":0},"kWh","År 0","Bru","Elektrisitet",{"$f":"Utslippsfaktorer!B23","v":"Elektrisitet anleggsfase, norsk miks"},{"$f":"SUMIF(Utslippsfaktorer!B:B,Beregninger!J70,Utslippsfaktorer!D:D)","v":2.6380000000000001E-2},{"$f":"VLOOKUP(J70,Utslippsfaktorer!B:C,2,FALSE)","v":"kg CO2e/kWh"},{"$f":"(E70*K70)/1000","v":0}]
[null,null,null,"Anleggsarbeid diesel",{"$f":"C61*(((SUM(Betongbru!E17:E26)*'Prosjektbeskrivelse og inndata'!C12)+(('Tillegg vei'!D12*Beregningsfaktorer!D83)+('Tillegg vei'!D13*Beregningsfaktorer!D87))))","v":292.13608260000001},"liter diesel","År 0","Bru","Diesel",{"$f":"Utslippsfaktorer!B20","v":"Fossil diesel (WTW)"},{"$f":"SUMIF(Utslippsfaktorer!B:B,Beregninger!J71,Utslippsfaktorer!D:D)","v":3.24},{"$f":"VLOOKUP(J71,Utslippsfaktorer!B:C,2,FALSE)","v":"kg CO2e/liter"},0.9465209076240001]
[null,null,null,"Anleggsarbeid biodiesel",{"$f":"C61*(((SUM(Betongbru!F17:F26)*'Prosjektbeskrivelse og inndata'!C12)+(('Tillegg vei'!E12*Beregningsfaktorer!D83)+('Tillegg vei'!E13*Beregningsfaktorer!D87))))","v":21.988737400000005},"liter biodiesel","År 0","Bru","Biodiesel",{"$f":"Utslippsfaktorer!B18","v":"Biodiesel (WTT)"},{"$f":"SUMIF(Utslippsfaktorer!B:B,Beregninger!J72,Utslippsfaktorer!D:D)","v":1.92},{"$f":"VLOOKUP(J72,Utslippsfaktorer!B:C,2,FALSE)","v":"kg CO2e/liter"},4.2218375808000003E-2]
[null,null,null,"Anleggsarbeid elektrisk/hydrogen",{"$f":"C61*(((SUM(Betongbru!G17:G26)*'Prosjektbeskrivelse og inndata'!C12)+(('Tillegg vei'!F12*Beregningsfaktorer!D83)+('Tillegg vei'!F13*Beregningsfaktorer!D87))))","v":0},"kWh","År 0","Bru","Elektrisitet",{"$f":"Utslippsfaktorer!B23","v":"Elektrisitet anleggsfase, norsk miks"},{"$f":"SUMIF(Utslippsfaktorer!B:B,Beregninger!J73,Utslippsfaktorer!D:D)","v":2.6380000000000001E-2},{"$f":"VLOOKUP(J73,Utslippsfaktorer!B:C,2,FALSE)","v":"kg CO2e/kWh"},0]
[null,"Stålbru (m)",{"$f":"SUMIF('Prosjektbeskrivelse og inndata'!$M:$M,B74,'Prosjektbeskrivelse og inndata'!$L:$L)","v":0},"Betong",{"$f":"C74*Stålbru!E5*'Prosjektbeskrivelse og inndata'!C13","v":0},"kg betong","År 0","Bru","Betong",{"$f":"Utslippsfaktorer!B10","v":"Betong"},{"$f":"SUMIF(Utslippsfaktorer!B:B,Beregninger!J74,Utslippsfaktorer!D:D)","v":0.13750000000000001},{"$f":"VLOOKUP(J74,Utslippsfaktorer!B:C,2,FALSE)","v":"kg CO2e/kg"},0]
[null,null,null,"Armeringsstål",{"$f":"C74*Stålbru!E6*'Prosjektbeskrivelse og inndata'!C13","v":0},"kg armeringsstål","År 0","Bru","Armeringsstål",{"$f":"Utslippsfaktorer!B5","v":"Armeringsstål"},{"$f":"SUMIF(Utslippsfaktorer!B:B,Beregninger!J75,Utslippsfaktorer!D:D)","v":0.61860000000000004},{"$f":"VLOOKUP(J75,Utslippsfaktorer!B:C,2,FALSE)","v":"kg CO2e/kg"},0]
[null,null,null,"Konstruksjonsstål",{"$f":"C74*Stålbru!E7*'Prosjektbeskrivelse og inndata'!C13","v":0},"kg stål","År 0","Bru","Stål",{"$f":"Utslippsfaktorer!B14","v":"Stål"},{"$f":"SUMIF(Utslippsfaktorer!B:B,Beregninger!J76,Utslippsfaktorer!D:D)","v":2.1234999999999999},{"$f":"VLOOKUP(J76,Utslippsfaktorer!B:C,2,FALSE)","v":"kg CO2e/kg"},0]
[null,null,null,"Slitelag skjelettasfalt (Ska)",{"$f":"C74*Stålbru!E8*'Prosjektbeskrivelse og inndata'!C13","v":0},"kg skjelettasfalt","År 0","Bru","Asfalt",{"$f":"Utslippsfaktorer!B7","v":"Skjelettasfalt (Ska)"},{"$f":"SUMIF(Utslippsfaktorer!B:B,Beregninger!J77,Utslippsfaktorer!D:D)","v":6.5699999999999995E-2},{"$f":"VLOOKUP(J77,Utslippsfaktorer!B:C,2,FALSE)","v":"kg CO2e/kg"},0]
[null,null,null,"Bindlag skjelettasfalt (Ska)",{"$f":"C74*Stålbru!E9*'Prosjektbeskrivelse og inndata'!C13","v":0},"kg skjelettasfalt","År 0","Bru","Asfalt",{"$f":"Utslippsfaktorer!B7","v":"Skjelettasfalt (Ska)"},{"$f":"SUMIF(Utslippsfaktorer!B:B,Beregninger!J78,Utslippsfaktorer!D:D)","v":6.5699999999999995E-2},{"$f":"VLOOKUP(J78,Utslippsfaktorer!B:C,2,FALSE)","v":"kg CO2e/kg"},0]
[null,null,null,"Fuktisolering (Topeka)",{"$f":"C74*Stålbru!E10*'Prosjektbeskrivelse og inndata'!C13","v":0},"kg topeka","År 0","Bru","Asfalt",{"$f":"Utslippsfaktorer!B9","v":"Topeka"},{"$f":"SUMIF(Utslippsfaktorer!B:B,Beregninger!J79,Utslippsfaktorer!D:D)","v":0.184},{"$f":"VLOOKUP(J79,Utslippsfaktorer!B:C,2,FALSE)","v":"kg CO2e/kg"},0]
[null,null,null,"Lyktestolper",{"$f":"C74*'Tillegg vei'!D5*Beregningsfaktorer!D81","v":0},"kg stål","År 0","Bru","Stål",{"$f":"Utslippsfaktorer!B14","v":"Stål"},{"$f":"SUMIF(Utslippsfaktorer!B:B,Beregninger!J80,Utslippsfaktorer!D:D)","v":2.1234999999999999},{"$f":"VLOOKUP(J80,Utslippsfaktorer!B:C,2,FALSE)","v":"kg CO2e/kg"},0]
[null,null,null,"Autovern/rekkverk",{"$f":"C74*'Tillegg vei'!D7*Beregningsfaktorer!D83","v":0},"kg stål","År 0","Bru","Stål",{"$f":"Utslippsfaktorer!B14","v":"Stål"},{"$f":"SUMIF(Utslippsfaktorer!B:B,Beregninger!J81,Utslippsfaktorer!D:D)","v":2.1234999999999999},{"$f":"VLOOKUP(J81,Utslippsfaktorer!B:C,2,FALSE)","v":"kg CO2e/kg"},0]
[null,null,null,"Transport diesel",{"$f":"C74*(((SUM(Stålbru!F5:F10)*'Prosjektbeskrivelse og inndata'!C13)+(('Tillegg vei'!E5*Beregningsfaktorer!D81)+('Tillegg vei'!E7*Beregningsfaktorer!D83))))","v":0},"liter diesel","År 0","Bru","Diesel",{"$f":"Utslippsfaktorer!B20","v":"Fossil diesel (WTW)"},{"$f":"SUMIF(Utslippsfaktorer!B:B,Beregninger!J82,Utslippsfaktorer!D:D)","v":3.24},{"$f":"VLOOKUP(J82,Utslippsfaktorer!B:C,2,FALSE)","v":"kg CO2e/liter"},0]
[null,null,null,"Transport biodiesel",{"$f":"C74*(((SUM(Stålbru!G5:G10)*'Prosjektbeskrivelse og inndata'!C13)+(('Tillegg vei'!F5*Beregningsfaktorer!D81)+('Tillegg vei'!F7*Beregningsfaktorer!D83))))","v":0},"liter biodiesel","År 0","Bru","Biodiesel",{"$f":"Utslippsfaktorer!B18","v":"Biodiesel (WTT)"},{"$f":"SUMIF(Utslippsfaktorer!B:B,Beregninger!J83,Utslippsfaktorer!D:D)","v":1.92},{"$f":"VLOOKUP(J83,Utslippsfaktorer!B:C,2,FALSE)","v":"kg CO2e/liter"},0]
[null,null,null,"Transport elektrisk/hydrogen",{"$f":"C74*(((SUM(Stålbru!H5:H10)*'Prosjektbeskrivelse og inndata'!C13)+(('Tillegg vei'!G5*Beregningsfaktorer!D81)+('Tillegg vei'!G7*Beregningsfaktorer!D83))))","v":0},"kWh","År 0","Bru","Elektrisitet",{"$f":"Utslippsfaktorer!B23","v":"Elektrisitet anleggsfase, norsk miks"},{"$f":"SUMIF(Utslippsfaktorer!B:B,Beregninger!J84,Utslippsfaktorer!D:D)","v":2.6380000000000001E-2},{"$f":"VLOOKUP(J84,Utslippsfaktorer!B:C,2,FALSE)","v":"kg CO2e/kWh"},0]
[null,null,null,"Anleggsarbeid diesel",{"$f":"C74*(((SUM(Stålbru!E18:E27)*'Prosjektbeskrivelse og inndata'!C13)+(('Tillegg vei'!D12*Beregningsfaktorer!D83)+('Tillegg vei'!D13*Beregningsfaktorer!D87))))","v":0},"liter diesel","År 0","Bru","Diesel",{"$f":"Utslippsfaktorer!B20","v":"Fossil diesel (WTW)"},{"$f":"SUMIF(Utslippsfaktorer!B:B,Beregninger!J85,Utslippsfaktorer!D:D)","v":3.24},{"$f":"VLOOKUP(J85,Utslippsfaktorer!B:C,2,FALSE)","v":"kg CO2e/liter"},0]
[null,null,null,"Anleggsarbeid biodiesel",{"$f":"C74*(((SUM(Stålbru!F18:F27)*'Prosjektbeskrivelse og inndata'!C13)+(('Tillegg vei'!E12*Beregningsfaktorer!D83)+('Tillegg vei'!E13*Beregningsfaktorer!D87))))","v":0},"liter biodiesel","År 0","Bru","Biodiesel",{"$f":"Utslippsfaktorer!B18","v":"Biodiesel (WTT)"},{"$f":"SUMIF(Utslippsfaktorer!B:B,Beregninger!J86,Utslippsfaktorer!D:D)","v":1.92},{"$f":"VLOOKUP(J86,Utslippsfaktorer!B:C,2,FALSE)","v":"kg CO2e/liter"},0]
[null,null,null,"Anleggsarbeid elektrisk/hydrogen",{"$f":"C74*(((SUM(Stålbru!G16:G27)*'Prosjektbeskrivelse og inndata'!C13)+(('Tillegg vei'!F12*Beregningsfaktorer!D83)+('Tillegg vei'!F13*Beregningsfaktorer!D87))))","v":0},"kWh","År 0","Bru","Elektrisitet",{"$f":"Utslippsfaktorer!B23","v":"Elektrisitet anleggsfase, norsk miks"},{"$f":"SUMIF(Utslippsfaktorer!B:B,Beregninger!J87,Utslippsfaktorer!D:D)","v":2.6380000000000001E-2},{"$f":"VLOOKUP(J87,Utslippsfaktorer!B:C,2,FALSE)","v":"kg CO2e/kWh"},0]
[null,"Tunnel enkeltløp (m)",{"$f":"SUMIF('Prosjektbeskrivelse og inndata'!$M:$M,B88,'Prosjektbeskrivelse og inndata'!$L:$L)","v":0},"Betong",{"$f":"C88*'Tunnel enkeltløp'!F10","v":0},"kg betong","År 0","Tunnel","Betong",{"$f":"Utslippsfaktorer!B10","v":"Betong"},{"$f":"SUMIF(Utslippsfaktorer!B:B,Beregninger!J88,Utslippsfaktorer!D:D)","v":0.13750000000000001},{"$f":"VLOOKUP(J88,Utslippsfaktorer!B:C,2,FALSE)","v":"kg CO2e/kg"},0]
[null,null,null,"Armeringsstål",{"$f":"C88*'Tunnel enkeltløp'!F11","v":0},"kg armeringsstål","År 0","Tunnel","Armeringsstål",{"$f":"Utslippsfaktorer!B5","v":"Armeringsstål"},{"$f":"SUMIF(Utslippsfaktorer!B:B,Beregninger!J89,Utslippsfaktorer!D:D)","v":0.61860000000000004},{"$f":"VLOOKUP(J89,Utslippsfaktorer!B:C,2,FALSE)","v":"kg CO2e/kg"},0]
[null,null,null,"Sikringsbolter",{"$f":"C88*'Tunnel enkeltløp'!F12","v":0},"kg stål","År 0","Tunnel","Stål",{"$f":"Utslippsfaktorer!B14","v":"Stål"},{"$f":"SUMIF(Utslippsfaktorer!B:B,Beregninger!J90,Utslippsfaktorer!D:D)","v":2.1234999999999999},{"$f":"VLOOKUP(J90,Utslippsfaktorer!B:C,2,FALSE)","v":"kg CO2e/kg"},0]
[null,null,null,"Frostsikring",{"$f":"C88*'Tunnel enkeltløp'!G13","v":0},"m2 isolasjon","År 0","Tunnel","Frostsikring tunnel",{"$f":"Utslippsfaktorer!B16","v":"XPS/betongelement"},{"$f":"SUMIF(Utslippsfaktorer!B:B,Beregninger!J91,Utslippsfaktorer!D:D)","v":66.814999999999998},{"$f":"VLOOKUP(J91,Utslippsfaktorer!B:C,2,FALSE)","v":"kg CO2e/m2"},{"$f":"(E91*K91)/1000","v":0}]
[null,null,null,"Slitelag skjelettasfalt (Ska)",{"$f":"C88*'Tunnel enkeltløp'!F14","v":0},"kg skjelettasfalt","År 0","Tunnel","Asfalt",{"$f":"Utslippsfaktorer!B7","v":"Skjelettasfalt (Ska)"},{"$f":"SUMIF(Utslippsfaktorer!B:B,Beregninger!J92,Utslippsfaktorer!D:D)","v":6.5699999999999995E-2},{"$f":"VLOOKUP(J92,Utslippsfaktorer!B:C,2,FALSE)","v":"kg CO2e/kg"},0]
[null,null,null,"Bindlag skjelettasfalt (Ska)",{"$f":"C88*'Tunnel enkeltløp'!F15","v":0},"kg skjelettasfalt","År 0","Tunnel","Asfalt",{"$f":"Utslippsfaktorer!B7","v":"Skjelettasfalt (Ska)"},{"$f":"SUMIF(Utslippsfaktorer!B:B,Beregninger!J93,Utslippsfaktorer!D:D)","v":6.5699999999999995E-2},{"$f":"VLOOKUP(J93,Utslippsfaktorer!B:C,2,FALSE)","v":"kg CO2e/kg"},0]
[null,null,null,"Bærelag asfaltgrus (Ag)",{"$f":"C88*'Tunnel enkeltløp'!F16","v":0},"kg asfaltgrus","År 0","Tunnel","Asfalt",{"$f":"Utslippsfaktorer!B8","v":"Asfaltgrus (Ag)"},{"$f":"SUMIF(Utslippsfaktorer!B:B,Beregninger!J94,Utslippsfaktorer!D:D)","v":4.8800000000000003E-2},{"$f":"VLOOKUP(J94,Utslippsfaktorer!B:C,2,FALSE)","v":"kg CO2e/kg"},0]
[null,null,null,"Autovern/rekkverk",{"$f":"C88*'Tillegg vei'!D7*Beregningsfaktorer!D83","v":0},"kg stål","År 0","Tunnel","Stål",{"$f":"Utslippsfaktorer!B14","v":"Stål"},{"$f":"SUMIF(Utslippsfaktorer!B:B,Beregninger!J95,Utslippsfaktorer!D:D)","v":2.1234999999999999},{"$f":"VLOOKUP(J95,Utslippsfaktorer!B:C,2,FALSE)","v":"kg CO2e/kg"},0]
[null,null,null,"Transport diesel",{"$f":"C88*(((SUM('Tunnel enkeltløp'!H10:H18))+('Tillegg vei'!E7*Beregningsfaktorer!D83)))","v":0},"liter diesel","År 0","Tunnel","Diesel",{"$f":"Utslippsfaktorer!B20","v":"Fossil diesel (WTW)"},{"$f":"SUMIF(Utslippsfaktorer!B:B,Beregninger!J96,Utslippsfaktorer!D:D)","v":3.24},{"$f":"VLOOKUP(J96,Utslippsfaktorer!B:C,2,FALSE)","v":"kg CO2e/liter"},0]
[null,null,null,"Transport biodiesel",{"$f":"C88*(((SUM('Tunnel enkeltløp'!I10:I18))+('Tillegg vei'!F7*Beregningsfaktorer!D83)))","v":0},"liter biodiesel","År 0","Tunnel","Biodiesel",{"$f":"Utslippsfaktorer!B18","v":"Biodiesel (WTT)"},{"$f":"SUMIF(Utslippsfaktorer!B:B,Beregninger!J97,Utslippsfaktorer!D:D)","v":1.92},{"$f":"VLOOKUP(J97,Utslippsfaktorer!B:C,2,FALSE)","v":"kg CO2e/liter"},0]
[null,null,null,"Transport elektrisk/hydrogen",{"$f":"C88*(((SUM('Tunnel enkeltløp'!J10:J18))+('Tillegg vei'!G7*Beregningsfaktorer!D83)))","v":0},"kWh","År 0","Tunnel","Elektrisitet",{"$f":"Utslippsfaktorer!B23","v":"Elektrisitet anleggsfase, norsk miks"},{"$f":"SUMIF(Utslippsfaktorer!B:B,Beregninger!J98,Utslippsfaktorer!D:D)","v":2.6380000000000001E-2},{"$f":"VLOOKUP(J98,Utslippsfaktorer!B:C,2,FALSE)","v":"kg CO2e/kWh"},0]
[null,null,null,"Anleggsarbeid diesel",{"$f":"C88*(((SUM('Tunnel enkeltløp'!E24:E37))+(('Tillegg vei'!D12*Beregningsfaktorer!D83)+('Tillegg vei'!D13*Beregningsfaktorer!D87))))","v":0},"liter diesel","År 0","Tunnel","Diesel",{"$f":"Utslippsfaktorer!B20","v":"Fossil diesel (WTW)"},{"$f":"SUMIF(Utslippsfaktorer!B:B,Beregninger!J99,Utslippsfaktorer!D:D)","v":3.24},{"$f":"VLOOKUP(J99,Utslippsfaktorer!B:C,2,FALSE)","v":"kg CO2e/liter"},0]
[null,null,null,"Anleggsarbeid biodiesel",{"$f":"C88*(((SUM('Tunnel enkeltløp'!F24:F37))+(('Tillegg vei'!E12*Beregningsfaktorer!D83)+('Tillegg vei'!E13*Beregningsfaktorer!D87))))","v":0},"liter biodiesel","År 0","Tunnel","Biodiesel",{"$f":"Utslippsfaktorer!B18","v":"Biodiesel (WTT)"},{"$f":"SUMIF(Utslippsfaktorer!B:B,Beregninger!J100,Utslippsfaktorer!D:D)","v":1.92},{"$f":"VLOOKUP(J100,Utslippsfaktorer!B:C,2,FALSE)","v":"kg CO2e/liter"},0]
[null,null,null,"Anleggsarbeid elektrisk/hydrogen",{"$f":"C88*(((SUM('Tunnel enkeltløp'!G24:G37))+(('Tillegg vei'!F12*Beregningsfaktorer!D83)+('Tillegg vei'!F13*Beregningsfaktorer!D87))))","v":0},"kWh","År 0","Tunnel","Elektrisitet",{"$f":"Utslippsfaktorer!B23","v":"Elektrisitet anleggsfase, norsk miks"},{"$f":"SUMIF(Utslippsfaktorer!B:B,Beregninger!J101,Utslippsfaktorer!D:D)","v":2.6380000000000001E-2},{"$f":"VLOOKUP(J101,Utslippsfaktorer!B:C,2,FALSE)","v":"kg CO2e/kWh"},0]
[null,"Tunnel dobbeltløp (m)",{"$f":"SUMIF('Prosjektbeskrivelse og inndata'!$M:$M,B102,'Prosjektbeskrivelse og inndata'!$L:$L)","v":0},"Betong",{"$f":"C102*'Tunnel dobbeltløp'!F10*2","v":0},"kg betong","År 0","Tunnel","Betong",{"$f":"Utslippsfaktorer!B10","v":"Betong"},{"$f":"SUMIF(Utslippsfaktorer!B:B,Beregninger!J102,Utslippsfaktorer!D:D)","v":0.13750000000000001},{"$f":"VLOOKUP(J102,Utslippsfaktorer!B:C,2,FALSE)","v":"kg CO2e/kg"},0]
[null,null,null,"Armeringsstål",{"$f":"C102*'Tunnel dobbeltløp'!F11*2","v":0},"kg armeringsstål","År 0","Tunnel","Armeringsstål",{"$f":"Utslippsfaktorer!B5","v":"Armeringsstål"},{"$f":"SUMIF(Utslippsfaktorer!B:B,Beregninger!J103,Utslippsfaktorer!D:D)","v":0.61860000000000004},{"$f":"VLOOKUP(J103,Utslippsfaktorer!B:C,2,FALSE)","v":"kg CO2e/kg"},0]
[null,null,null,"Sikringsbolter",{"$f":"C102*'Tunnel dobbeltløp'!F12*2","v":0},"kg stål","År 0","Tunnel","Stål",{"$f":"Utslippsfaktorer!B14","v":"Stål"},{"$f":"SUMIF(Utslippsfaktorer!B:B,Beregninger!J104,Utslippsfaktorer!D:D)","v":2.1234999999999999},{"$f":"VLOOKUP(J104,Utslippsfaktorer!B:C,2,FALSE)","v":"kg CO2e/kg"},0]
[null,null,null,"Frostsikring",{"$f":"C102*'Tunnel dobbeltløp'!G13","v":0},"m2 isolasjon","År 0","Tunnel","Frostsikring tunnel",{"$f":"Utslippsfaktorer!B16","v":"XPS/betongelement"},{"$f":"SUMIF(Utslippsfaktorer!B:B,Beregninger!J105,Utslippsfaktorer!D:D)","v":66.814999999999998},{"$f":"VLOOKUP(J105,Utslippsfaktorer!B:C,2,FALSE)","v":"kg CO2e/m2"},0]
[null,null,null,"Slitelag skjelettasfalt (Ska)",{"$f":"C102*'Tunnel dobbeltløp'!F14*2","v":0},"kg skjelettasfalt","År 0","Tunnel","Asfalt",{"$f":"Utslippsfaktorer!B7","v":"Skjelettasfalt (Ska)"},{"$f":"SUMIF(Utslippsfaktorer!B:B,Beregninger!J106,Utslippsfaktorer!D:D)","v":6.5699999999999995E-2},{"$f":"VLOOKUP(J106,Utslippsfaktorer!B:C,2,FALSE)","v":"kg CO2e/kg"},0]
[null,null,null,"Bindlag skjelettasfalt (Ska)",{"$f":"C102*'Tunnel dobbeltløp'!F15*2","v":0},"kg skjelettasfalt","År 0","Tunnel","Asfalt",{"$f":"Utslippsfaktorer!B7","v":"Skjelettasfalt (Ska)"},{"$f":"SUMIF(Utslippsfaktorer!B:B,Beregninger!J107,Utslippsfaktorer!D:D)","v":6.5699999999999995E-2},{"$f":"VLOOKUP(J107,Utslippsfaktorer!B:C,2,FALSE)","v":"kg CO2e/kg"},0]
[null,null,null,"Bærelag asfaltgrus (Ag)",{"$f":"C102*'Tunnel dobbeltløp'!F16*2","v":0},"kg asfaltgrus","År 0","Tunnel","Asfalt",{"$f":"Utslippsfaktorer!B8","v":"Asfaltgrus (Ag)"},{"$f":"SUMIF(Utslippsfaktorer!B:B,Beregninger!J108,Utslippsfaktorer!D:D)","v":4.8800000000000003E-2},{"$f":"VLOOKUP(J108,Utslippsfaktorer!B:C,2,FALSE)","v":"kg CO2e/kg"},0]
[null,null,null,"Autovern/rekkverk",{"$f":"C102*'Tillegg vei'!D7*Beregningsfaktorer!D84*2","v":0},"kg stål","År 0","Tunnel","Stål",{"$f":"Utslippsfaktorer!B14","v":"Stål"},{"$f":"SUMIF(Utslippsfaktorer!B:B,Beregninger!J109,Utslippsfaktorer!D:D)","v":2.1234999999999999},{"$f":"VLOOKUP(J109,Utslippsfaktorer!B:C,2,FALSE)","v":"kg CO2e/kg"},0]
[null,null,null,"Transport diesel",{"$f":"C102*(((SUM('Tunnel dobbeltløp'!H10:H18))+('Tillegg vei'!E7*Beregningsfaktorer!D84)))*2","v":0},"liter diesel","År 0","Tunnel","Diesel",{"$f":"Utslippsfaktorer!B20","v":"Fossil diesel (WTW)"},{"$f":"SUMIF(Utslippsfaktorer!B:B,Beregninger!J110,Utslippsfaktorer!D:D)","v":3.24},{"$f":"VLOOKUP(J110,Utslippsfaktorer!B:C,2,FALSE)","v":"kg CO2e/liter"},0]
[null,null,null,"Transport biodiesel",{"$f":"C102*(((SUM('Tunnel dobbeltløp'!I10:I18))+('Tillegg vei'!F7*Beregningsfaktorer!D84)))*2","v":0},"liter biodiesel","År 0","Tunnel","Biodiesel",{"$f":"Utslippsfaktorer!B18","v":"Biodiesel (WTT)"},{"$f":"SUMIF(Utslippsfaktorer!B:B,Beregninger!J111,Utslippsfaktorer!D:D)","v":1.92},{"$f":"VLOOKUP(J111,Utslippsfaktorer!B:C,2,FALSE)","v":"kg CO2e/liter"},0]
[null,null,null,"Transport elektrisk/hydrogen",{"$f":"C102*(((SUM('Tunnel dobbeltløp'!J10:J18))+('Tillegg vei'!G7*Beregningsfaktorer!D84)))*2","v":0},"kWh","År 0","Tunnel","Elektrisitet",{"$f":"Utslippsfaktorer!B23","v":"Elektrisitet anleggsfase, norsk miks"},{"$f":"SUMIF(Utslippsfaktorer!B:B,Beregninger!J112,Utslippsfaktorer!D:D)","v":2.6380000000000001E-2},{"$f":"VLOOKUP(J112,Utslippsfaktorer!B:C,2,FALSE)","v":"kg CO2e/kWh"},0]
[null,null,null,"Anleggsarbeid diesel",{"$f":"C102*(((SUM('Tunnel dobbeltløp'!E24:E37))+(('Tillegg vei'!D12*Beregningsfaktorer!D84)+('Tillegg vei'!D13*Beregningsfaktorer!D88))))*2","v":0},"liter diesel","År 0","Tunnel","Diesel",{"$f":"Utslippsfaktorer!B20","v":"Fossil diesel (WTW)"},{"$f":"SUMIF(Utslippsfaktorer!B:B,Beregninger!J113,Utslippsfaktorer!D:D)","v":3.24},{"$f":"VLOOKUP(J113,Utslippsfaktorer!B:C,2,FALSE)","v":"kg CO2e/liter"},0]
[null,null,null,"Anleggsarbeid biodiesel",{"$f":"C102*(((SUM('Tunnel dobbeltløp'!F24:F37))+(('Tillegg vei'!E12*Beregningsfaktorer!D84)+('Tillegg vei'!E13*Beregningsfaktorer!D88))))*2","v":0},"liter biodiesel","År 0","Tunnel","Biodiesel",{"$f":"Utslippsfaktorer!B18","v":"Biodiesel (WTT)"},{"$f":"SUMIF(Utslippsfaktorer!B:B,Beregninger!J114,Utslippsfaktorer!D:D)","v":1.92},{"$f":"VLOOKUP(J114,Utslippsfaktorer!B:C,2,FALSE)","v":"kg CO2e/liter"},0]
[null,null,null,"Anleggsarbeid elektrisk/hydrogen",{"$f":"C102*(((SUM('Tunnel dobbeltløp'!G24:G37))+(('Tillegg vei'!F12*Beregningsfaktorer!D84)+('Tillegg vei'!F13*Beregningsfaktorer!D88))))*2","v":0},"kWh","År 0","Tunnel","Elektrisitet",{"$f":"Utslippsfaktorer!B23","v":"Elektrisitet anleggsfase, norsk miks"},{"$f":"SUMIF(Utslippsfaktorer!B:B,Beregninger!J115,Utslippsfaktorer!D:D)","v":2.6380000000000001E-2},{"$f":"VLOOKUP(J115,Utslippsfaktorer!B:C,2,FALSE)","v":"kg CO2e/kWh"},0]
[null,"Betongkulvert (m2)",{"$f":"SUMIF('Prosjektbeskrivelse og inndata'!$M:$M,B116,'Prosjektbeskrivelse og inndata'!$L:$L)","v":225},"Betong",{"$f":"C116*Kulvert!E5","v":673920},"kg betong","År 0","Kulvert","Betong",{"$f":"Utslippsfaktorer!B10","v":"Betong"},{"$f":"SUMIF(Utslippsfaktorer!B:B,Beregninger!J116,Utslippsfaktorer!D:D)","v":0.13750000000000001},{"$f":"VLOOKUP(J116,Utslippsfaktorer!B:C,2,FALSE)","v":"kg CO2e/kg"},92.664000000000016]
[null,null,null,"Armeringsstål",{"$f":"C116*Kulvert!E6","v":51839.999999999993},"kg armeringsstål","År 0","Kulvert","Armeringsstål",{"$f":"Utslippsfaktorer!B5","v":"Armeringsstål"},{"$f":"SUMIF(Utslippsfaktorer!B:B,Beregninger!J117,Utslippsfaktorer!D:D)","v":0.61860000000000004},{"$f":"VLOOKUP(J117,Utslippsfaktorer!B:C,2,FALSE)","v":"kg CO2e/kg"},32.068224000000001]
[null,null,null,"Transport diesel",{"$f":"C116*(SUM(Kulvert!F5:F6))","v":887.08607999999981},"liter diesel","År 0","Kulvert","Diesel",{"$f":"Utslippsfaktorer!B20","v":"Fossil diesel (WTW)"},{"$f":"SUMIF(Utslippsfaktorer!B:B,Beregninger!J118,Utslippsfaktorer!D:D)","v":3.24},{"$f":"VLOOKUP(J118,Utslippsfaktorer!B:C,2,FALSE)","v":"kg CO2e/liter"},2.8741588991999998]
[null,null,null,"Transport biodiesel",{"$f":"C116*(SUM(Kulvert!G5:G6))","v":66.769919999999999},"liter biodiesel","År 0","Kulvert","Biodiesel",{"$f":"Utslippsfaktorer!B18","v":"Biodiesel (WTT)"},{"$f":"SUMIF(Utslippsfaktorer!B:B,Beregninger!J119,Utslippsfaktorer!D:D)","v":1.92},{"$f":"VLOOKUP(J119,Utslippsfaktorer!B:C,2,FALSE)","v":"kg CO2e/liter"},0.12819824639999999]
[null,null,null,"Transport elektrisk/hydrogen",{"$f":"C116*(SUM(Kulvert!H5:H6))","v":0},"kWh","År 0","Kulvert","Elektrisitet",{"$f":"Utslippsfaktorer!B23","v":"Elektrisitet anleggsfase, norsk miks"},{"$f":"SUMIF(Utslippsfaktorer!B:B,Beregninger!J120,Utslippsfaktorer!D:D)","v":2.6380000000000001E-2},{"$f":"VLOOKUP(J120,Utslippsfaktorer!B:C,2,FALSE)","v":"kg CO2e/kWh"},0]
[null,null,null,"Anleggsarbeid diesel",null,"liter diesel","År 0","Kulvert","Diesel",{"$f":"Utslippsfaktorer!B20","v":"Fossil diesel (WTW)"},{"$f":"SUMIF(Utslippsfaktorer!B:B,Beregninger!J121,Utslippsfaktorer!D:D)","v":3.24},{"$f":"VLOOKUP(J121,Utslippsfaktorer!B:C,2,FALSE)","v":"kg CO2e/liter"},0]
[null,null,null,"Anleggsarbeid biodiesel",null,"liter biodiesel","År 0","Kulvert","Biodiesel",{"$f":"Utslippsfaktorer!B18","v":"Biodiesel (WTT)"},{"$f":"SUMIF(Utslippsfaktorer!B:B,Beregninger!J122,Utslippsfaktorer!D:D)","v":1.92},{"$f":"VLOOKUP(J122,Utslippsfaktorer!B:C,2,FALSE)","v":"kg CO2e/liter"},0]
[null,null,null,"Anleggsarbeid elektrisk/hydrogen",{"$f":"'Prosjektbeskrivelse og inndata'!C8*Kulvert!G11","v":2624.4},"kWh","År 0","Kulvert","Elektrisitet",{"$f":"Utslippsfaktorer!B23","v":"Elektrisitet anleggsfase, norsk miks"},{"$f":"SUMIF(Utslippsfaktorer!B:B,Beregninger!J123,Utslippsfaktorer!D:D)","v":2.6380000000000001E-2},{"$f":"VLOOKUP(J123,Utslippsfaktorer!B:C,2,FALSE)","v":"kg CO2e/kWh"},6.9231672000000008E-2]
["Drift- og vedlikeholdsfase",null,null,null,null,null,"Drifts-intervall [år]",null,null,null,null,null,null,"Sum analyse-periode","Verdi i år"]
[null,null,null,null,null,null,null,null,null,null,null,null,null,null,1,2,3,4,5,6,7,8,9,10,11,12,13,14,15,16,17,18,19,20,21,22,23,24,25,26,27,28,29,30,31,32,33,34,35,36,37,38,39,40,41,42,43,44,45,46,47,48,49,50,51,52,53,54,55,56,57,58,59,60]
[null,"Drift hovedvei (m)",{"$f":"SUMIF('Prosjektbeskrivelse og inndata'!$M:$M,B32,'Prosjektbeskrivelse og inndata'!$L:$L)","v":4700},"Asfalt til reasfaltering",{"$f":"C126*'Prosjektbeskrivelse og inndata'!C9*Reasfaltering!D8","v":2379375},"kg skjelettasfalt",{"$f":"Beregningsfaktorer!D50","v":7},"Reasfaltering","Asfalt",{"$f":"Utslippsfaktorer!B7","v":"Skjelettasfalt (Ska)"},{"$f":"SUMIF(Utslippsfaktorer!B:B,Beregninger!J126,Utslippsfaktorer!D:D)","v":6.5699999999999995E-2},{"$f":"VLOOKUP(J126,Utslippsfaktorer!B:C,2,FALSE)","v":"kg CO2e/kg"},{"$f":"(E126*K126)/1000","v":156.3249375},{"$f":"SUMIF($O$125:$BV$125,\"<=\" & 'Prosjektbeskrivelse og inndata'!$C$14,O126:BL126)","v":1250.5995},{"$f":"IF(MOD(O$125,$G126)=0,$M126,\"\")","v":""},"","","","","",156.3249375,"","","",{"$f":"IF(MOD(Y$125,$G126)=0,$M126,\"\")","v":""},"","",156.3249375,"","","","","","",{"$f":"IF(MOD(AI$125,$G126)=0,$M126,\"\")","v":156.3249375},"","","","","","",156.3249375,"","",{"$f":"IF(MOD(AS$125,$G126)=0,$M126,\"\")","v":""},"","","",156.3249375,"","","","","",{"$f":"IF(MOD(BC$125,$G126)=0,$M126,\"\")","v":""},156.3249375,"","","","","","",156.3249375,"",{"$f":"IF(MOD(BM$125,$G126)=0,$M126,\"\")","v":""},"","","","",156.3249375,"","","",""]
[null,null,null,"Transport av asfalt diesel",{"$f":"C126*'Prosjektbeskrivelse og inndata'!C9*Reasfaltering!E8","v":663.84562499999993},"liter diesel",{"$f":"Beregningsfaktorer!D50","v":7},"Reasfaltering","Diesel",{"$f":"Utslippsfaktorer!B20","v":"Fossil diesel (WTW)"},{"$f":"SUMIF(Utslippsfaktorer!B:B,Beregninger!J127,Utslippsfaktorer!D:D)","v":3.24},{"$f":"VLOOKUP(J127,Utslippsfaktorer!B:C,2,FALSE)","v":"kg CO2e/liter"},{"$f":"(E127*K127)/1000","v":2.1508598249999999},{"$f":"SUMIF($O$125:$BV$125,\"<=\" & 'Prosjektbeskrivelse og inndata'!$C$14,O127:BL127)","v":17.2068786},"","","","","","",2.1508598249999999,"","","","","","",2.1508598249999999,"","","","","","",2.1508598249999999,"","","","","","",2.1508598249999999,"","","","","","",2.1508598249999999,"","","","","","",2.1508598249999999,"","","","","","",2.1508598249999999,"","","","","","",2.1508598249999999,"","","",""]
[null,null,null,"Transport av asfalt biodiesel",{"$f":"C126*'Prosjektbeskrivelse og inndata'!C9*Reasfaltering!F8","v":49.966875000000002},"liter biodiesel",{"$f":"Beregningsfaktorer!D50","v":7},"Reasfaltering","Biodiesel",{"$f":"Utslippsfaktorer!B18","v":"Biodiesel (WTT)"},{"$f":"SUMIF(Utslippsfaktorer!B:B,Beregninger!J128,Utslippsfaktorer!D:D)","v":1.92},{"$f":"VLOOKUP(J128,Utslippsfaktorer!B:C,2,FALSE)","v":"kg CO2e/liter"},9.5936400000000005E-2,{"$f":"SUMIF($O$125:$BV$125,\"<=\" & 'Prosjektbeskrivelse og inndata'!$C$14,O128:BL128)","v":0.76749120000000015},"","","","","","",9.5936400000000005E-2,"","","","","","",9.5936400000000005E-2,"","","","","","",9.5936400000000005E-2,"","","","","","",9.5936400000000005E-2,"","","","","","",9.5936400000000005E-2,"","","","","","",9.5936400000000005E-2,"","","","","","",9.5936400000000005E-2,"","","","","","",9.5936400000000005E-2,"","","",""]
[null,null,null,"Transport av asfalt elektrisk/hydrogen",{"$f":"C126*'Prosjektbeskrivelse og inndata'!C9*Reasfaltering!G8","v":0},"kWh",{"$f":"Beregningsfaktorer!D50","v":7},"Reasfaltering","Elektrisitet",{"$f":"Utslippsfaktorer!B24","v":"Elektrisitet 55 år, europeisk miks"},{"$f":"SUMIF(Utslippsfaktorer!B:B,Beregninger!J129,Utslippsfaktorer!D:D)","v":0.13600000000000001},{"$f":"VLOOKUP(J129,Utslippsfaktorer!B:C,2,FALSE)","v":"kg CO2e/kWh"},0,{"$f":"SUMIF($O$125:$BV$125,\"<=\" & 'Prosjektbeskrivelse og inndata'!$C$14,O129:BL129)","v":0},"","","","","","",0,"","","","","","",0,"","","","","","",0,"","","","","","",0,"","","","","","",0,"","","","","","",0,"","","","","","",0,"","","","","","",0,"","","",""]
[null,null,null,"Reasfaltering diesel",{"$f":"C126*'Prosjektbeskrivelse og inndata'!C9*Reasfaltering!E8","v":663.84562499999993},"liter diesel",{"$f":"Beregningsfaktorer!D50","v":7},"Reasfaltering","Diesel",{"$f":"Utslippsfaktorer!B20","v":"Fossil diesel (WTW)"},{"$f":"SUMIF(Utslippsfaktorer!B:B,Beregninger!J130,Utslippsfaktorer!D:D)","v":3.24},{"$f":"VLOOKUP(J130,Utslippsfaktorer!B:C,2,FALSE)","v":"kg CO2e/liter"},2.1508598249999999,{"$f":"SUMIF($O$125:$BV$125,\"<=\" & 'Prosjektbeskrivelse og inndata'!$C$14,O130:BL130)","v":17.2068786},"","","","","","",2.1508598249999999,"","","","","","",2.1508598249999999,"","","","","","",2.1508598249999999,"","","","","","",2.1508598249999999,"","","","","","",2.1508598249999999,"","","","","","",2.1508598249999999,"","","","","","",2.1508598249999999,"","","","","","",2.1508598249999999,"","","",""]
[null,null,null,"Reasfaltering biodiesel",{"$f":"C126*'Prosjektbeskrivelse og inndata'!C9*Reasfaltering!F8","v":49.966875000000002},"liter biodiesel",{"$f":"Beregningsfaktorer!D50","v":7},"Reasfaltering","Biodiesel",{"$f":"Utslippsfaktorer!B18","v":"Biodiesel (WTT)"},{"$f":"SUMIF(Utslippsfaktorer!B:B,Beregninger!J131,Utslippsfaktorer!D:D)","v":1.92},{"$f":"VLOOKUP(J131,Utslippsfaktorer!B:C,2,FALSE)","v":"kg CO2e/liter"},9.5936400000000005E-2,{"$f":"SUMIF($O$125:$BV$125,\"<=\" & 'Prosjektbeskrivelse og inndata'!$C$14,O131:BL131)","v":0.76749120000000015},"","","","","","",9.5936400000000005E-2,"","","","","","",9.5936400000000005E-2,"","","","","","",9.5936400000000005E-2,"","","","","","",9.5936400000000005E-2,"","","","","","",9.5936400000000005E-2,"","","","","","",9.5936400000000005E-2,"","","","","","",9.5936400000000005E-2,"","","","","","",9.5936400000000005E-2,"","","",""]
[null,null,null,"Reasfaltering elektrisk/hydrogen",{"$f":"C126*'Prosjektbeskrivelse og inndata'!C9*Reasfaltering!G8","v":0},"kWh",{"$f":"Beregningsfaktorer!D50","v":7},"Reasfaltering","Elektrisitet",{"$f":"Utslippsfaktorer!B24","v":"Elektrisitet 55 år, europeisk miks"},{"$f":"SUMIF(Utslippsfaktorer!B:B,Beregninger!J132,Utslippsfaktorer!D:D)","v":0.13600000000000001},{"$f":"VLOOKUP(J132,Utslippsfaktorer!B:C,2,FALSE)","v":"kg CO2e/kWh"},0,{"$f":"SUMIF($O$125:$BV$125,\"<=\" & 'Prosjektbeskrivelse og inndata'!$C$14,O132:BL132)","v":0},"","","","","","",0,"","","","","","",0,"","","","","","",0,"","","","","","",0,"","","","","","",0,"","","","","","",0,"","","","","","",0,"","","","","","",0,"","","",""]
[null,null,null,"Kantklipp diesel",{"$f":"C126*'Drift og vedlikehold'!E24*Beregningsfaktorer!D85","v":13.113},"liter diesel",1,"Drift","Diesel",{"$f":"Utslippsfaktorer!B20","v":"Fossil diesel (WTW)"},{"$f":"SUMIF(Utslippsfaktorer!B:B,Beregninger!J133,Utslippsfaktorer!D:D)","v":3.24},{"$f":"VLOOKUP(J133,Utslippsfaktorer!B:C,2,FALSE)","v":"kg CO2e/liter"},4.2486120000000002E-2,{"$f":"SUMIF($O$125:$BV$125,\"<=\" & 'Prosjektbeskrivelse og inndata'!$C$14,O133:BL133)","v":2.5491671999999985},4.2486120000000002E-2,4.2486120000000002E-2,4.2486120000000002E-2,4.2486120000000002E-2,4.2486120000000002E-2,4.2486120000000002E-2,4.2486120000000002E-2,4.2486120000000002E-2,4.2486120000000002E-2,4.2486120000000002E-2,4.2486120000000002E-2,4.2486120000000002E-2,4.2486120000000002E-2,4.2486120000000002E-2,4.2486120000000002E-2,4.2486120000000002E-2,4.2486120000000002E-2,4.2486120000000002E-2,4.2486120000000002E-2,4.2486120000000002E-2,4.2486120000000002E-2,4.2486120000000002E-2,4.2486120000000002E-2,4.2486120000000002E-2,4.2486120000000002E-2,4.2486120000000002E-2,4.2486120000000002E-2,4.2486120000000002E-2,4.2486120000000002E-2,4.2486120000000002E-2,4.2486120000000002E-2,4.2486120000000002E-2,4.2486120000000002E-2,4.2486120000000002E-2,4.2486120000000002E-2,4.2486120000000002E-2,4.2486120000000002E-2,4.2486120000000002E-2,4.2486120000000002E-2,4.2486120000000002E-2,4.2486120000000002E-2,4.2486120000000002E-2,4.2486120000000002E-2,4.2486120000000002E-2,4.2486120000000002E-2,4.2486120000000002E-2,4.2486120000000002E-2,4.2486120000000002E-2,4.2486120000000002E-2,4.2486120000000002E-2,4.2486120000000002E-2,4.2486120000000002E-2,4.2486120000000002E-2,4.2486120000000002E-2,4.2486120000000002E-2,4.2486120000000002E-2,4.2486120000000002E-2,4.2486120000000002E-2,4.2486120000000002E-2,4.2486120000000002E-2]
[null,null,null,"Kantklipp biodiesel",{"$f":"C126*'Drift og vedlikehold'!F24*Beregningsfaktorer!D85","v":0.9870000000000001},"liter biodiesel",1,"Drift","Biodiesel",{"$f":"Utslippsfaktorer!B18","v":"Biodiesel (WTT)"},{"$f":"SUMIF(Utslippsfaktorer!B:B,Beregninger!J134,Utslippsfaktorer!D:D)","v":1.92},{"$f":"VLOOKUP(J134,Utslippsfaktorer!B:C,2,FALSE)","v":"kg CO2e/liter"},1.89504E-3,{"$f":"SUMIF($O$125:$BV$125,\"<=\" & 'Prosjektbeskrivelse og inndata'!$C$14,O134:BL134)","v":0.11370240000000002},1.89504E-3,1.89504E-3,1.89504E-3,1.89504E-3,1.89504E-3,1.89504E-3,1.89504E-3,1.89504E-3,1.89504E-3,1.89504E-3,1.89504E-3,1.89504E-3,1.89504E-3,1.89504E-3,1.89504E-3,1.89504E-3,1.89504E-3,1.89504E-3,1.89504E-3,1.89504E-3,1.89504E-3,1.89504E-3,1.89504E-3,1.89504E-3,1.89504E-3,1.89504E-3,1.89504E-3,1.89504E-3,1.89504E-3,1.89504E-3,1.89504E-3,1.89504E-3,1.89504E-3,1.89504E-3,1.89504E-3,1.89504E-3,1.89504E-3,1.89504E-3,1.89504E-3,1.89504E-3,1.89504E-3,1.89504E-3,1.89504E-3,1.89504E-3,1.89504E-3,1.89504E-3,1.89504E-3,1.89504E-3,1.89504E-3,1.89504E-3,1.89504E-3,1.89504E-3,1.89504E-3,1.89504E-3,1.89504E-3,1.89504E-3,1.89504E-3,1.89504E-3,1.89504E-3,1.89504E-3]
[null,null,null,"Kantklipp elektrisk/hydrogen",{"$f":"C126*'Drift og vedlikehold'!G24*Beregningsfaktorer!D85","v":0},"kWh",1,"Drift","Elektrisitet",{"$f":"Utslippsfaktorer!B24","v":"Elektrisitet 55 år, europeisk miks"},{"$f":"SUMIF(Utslippsfaktorer!B:B,Beregninger!J135,Utslippsfaktorer!D:D)","v":0.13600000000000001},{"$f":"VLOOKUP(J135,Utslippsfaktorer!B:C,2,FALSE)","v":"kg CO2e/kWh"},0,{"$f":"SUMIF($O$125:$BV$125,\"<=\" & 'Prosjektbeskrivelse og inndata'!$C$14,O135:BL135)","v":0},0,0,0,0,0,0,0,0,0,0,0,0,0,0,0,0,0,0,0,0,0,0,0,0,0,0,0,0,0,0,0,0,0,0,0,0,0,0,0,0,0,0,0,0,0,0,0,0,0,0,0,0,0,0,0,0,0,0,0,0]
[null,null,null,"Grøfterensk diesel",{"$f":"C126*'Drift og vedlikehold'!E25*Beregningsfaktorer!D85","v":874.19999999999993},"liter diesel",{"$f":"Beregningsfaktorer!D54","v":3},"Drift","Diesel",{"$f":"Utslippsfaktorer!B20","v":"Fossil diesel (WTW)"},{"$f":"SUMIF(Utslippsfaktorer!B:B,Beregninger!J136,Utslippsfaktorer!D:D)","v":3.24},{"$f":"VLOOKUP(J136,Utslippsfaktorer!B:C,2,FALSE)","v":"kg CO2e/liter"},2.832408,{"$f":"SUMIF($O$125:$BV$125,\"<=\" & 'Prosjektbeskrivelse og inndata'!$C$14,O136:BL136)","v":56.648160000000011},{"$f":"IF(MOD(O$125,$G136)=0,$M136,\"\")","v":""},"",2.832408,"","",2.832408,"","",2.832408,"",{"$f":"IF(MOD(Y$125,$G136)=0,$M136,\"\")","v":""},2.832408,"","",2.832408,"","",2.832408,"","",{"$f":"IF(MOD(AI$125,$G136)=0,$M136,\"\")","v":2.832408},"","",2.832408,"","",2.832408,"","",2.832408,{"$f":"IF(MOD(AS$125,$G136)=0,$M136,\"\")","v":""},"",2.832408,"","",2.832408,"","",2.832408,"",{"$f":"IF(MOD(BC$125,$G136)=0,$M136,\"\")","v":""},2.832408,"","",2.832408,"","",2.832408,"","",{"$f":"IF(MOD(BM$125,$G136)=0,$M136,\"\")","v":2.832408},"","",2.832408,"","",2.832408,"","",2.832408]
[null,null,null,"Grøfterensk biodiesel",{"$f":"C126*'Drift og vedlikehold'!F25*Beregningsfaktorer!D85","v":65.8},"liter biodiesel",{"$f":"Beregningsfaktorer!D54","v":3},"Drift","Biodiesel",{"$f":"Utslippsfaktorer!B18","v":"Biodiesel (WTT)"},{"$f":"SUMIF(Utslippsfaktorer!B:B,Beregninger!J137,Utslippsfaktorer!D:D)","v":1.92},{"$f":"VLOOKUP(J137,Utslippsfaktorer!B:C,2,FALSE)","v":"kg CO2e/liter"},0.12633599999999998,{"$f":"SUMIF($O$125:$BV$125,\"<=\" & 'Prosjektbeskrivelse og inndata'!$C$14,O137:BL137)","v":2.5267199999999987},"","",0.12633599999999998,"","",0.12633599999999998,"","",0.12633599999999998,"","",0.12633599999999998,"","",0.12633599999999998,"","",0.12633599999999998,"","",0.12633599999999998,"","",0.12633599999999998,"","",0.12633599999999998,"","",0.12633599999999998,"","",0.12633599999999998,"","",0.12633599999999998,"","",0.12633599999999998,"","",0.12633599999999998,"","",0.12633599999999998,"","",0.12633599999999998,"","",0.12633599999999998,"","",0.12633599999999998,"","",0.12633599999999998,"","",0.12633599999999998]
[null,null,null,"Grøfterensk elektrisk/hydrogen",{"$f":"C126*'Drift og vedlikehold'!G25*Beregningsfaktorer!D85","v":0},"kWh",{"$f":"Beregningsfaktorer!D54","v":3},"Drift","Elektrisitet",{"$f":"Utslippsfaktorer!B24","v":"Elektrisitet 55 år, europeisk miks"},{"$f":"SUMIF(Utslippsfaktorer!B:B,Beregninger!J138,Utslippsfaktorer!D:D)","v":0.13600000000000001},{"$f":"VLOOKUP(J138,Utslippsfaktorer!B:C,2,FALSE)","v":"kg CO2e/kWh"},0,{"$f":"SUMIF($O$125:$BV$125,\"<=\" & 'Prosjektbeskrivelse og inndata'!$C$14,O138:BL138)","v":0},"","",0,"","",0,"","",0,"","",0,"","",0,"","",0,"","",0,"","",0,"","",0,"","",0,"","",0,"","",0,"","",0,"","",0,"","",0,"","",0,"","",0,"","",0,"","",0,"","",0]
[null,null,null,"Transport jordmasser grøfterensk diesel",{"$f":"C126*'Drift og vedlikehold'!F15*Beregningsfaktorer!D85","v":226.72377},"liter diesel",{"$f":"Beregningsfaktorer!D54","v":3},"Drift","Diesel",{"$f":"Utslippsfaktorer!B20","v":"Fossil diesel (WTW)"},{"$f":"SUMIF(Utslippsfaktorer!B:B,Beregninger!J139,Utslippsfaktorer!D:D)","v":3.24},{"$f":"VLOOKUP(J139,Utslippsfaktorer!B:C,2,FALSE)","v":"kg CO2e/liter"},0.73458501480000005,{"$f":"SUMIF($O$125:$BV$125,\"<=\" & 'Prosjektbeskrivelse og inndata'!$C$14,O139:BL139)","v":14.691700296000006},"","",0.73458501480000005,"","",0.73458501480000005,"","",0.73458501480000005,"","",0.73458501480000005,"","",0.73458501480000005,"","",0.73458501480000005,"","",0.73458501480000005,"","",0.73458501480000005,"","",0.73458501480000005,"","",0.73458501480000005,"","",0.73458501480000005,"","",0.73458501480000005,"","",0.73458501480000005,"","",0.73458501480000005,"","",0.73458501480000005,"","",0.73458501480000005,"","",0.73458501480000005,"","",0.73458501480000005,"","",0.73458501480000005,"","",0.73458501480000005]
[null,null,null,"Transport jordmasser grøfterensk biodiesel",{"$f":"C126*'Drift og vedlikehold'!G15*Beregningsfaktorer!D85","v":17.06523},"liter biodiesel",{"$f":"Beregningsfaktorer!D54","v":3},"Drift","Biodiesel",{"$f":"Utslippsfaktorer!B18","v":"Biodiesel (WTT)"},{"$f":"SUMIF(Utslippsfaktorer!B:B,Beregninger!J140,Utslippsfaktorer!D:D)","v":1.92},{"$f":"VLOOKUP(J140,Utslippsfaktorer!B:C,2,FALSE)","v":"kg CO2e/liter"},3.2765241599999995E-2,{"$f":"SUMIF($O$125:$BV$125,\"<=\" & 'Prosjektbeskrivelse og inndata'!$C$14,O140:BL140)","v":0.65530483199999967},"","",3.2765241599999995E-2,"","",3.2765241599999995E-2,"","",3.2765241599999995E-2,"","",3.2765241599999995E-2,"","",3.2765241599999995E-2,"","",3.2765241599999995E-2,"","",3.2765241599999995E-2,"","",3.2765241599999995E-2,"","",3.2765241599999995E-2,"","",3.2765241599999995E-2,"","",3.2765241599999995E-2,"","",3.2765241599999995E-2,"","",3.2765241599999995E-2,"","",3.2765241599999995E-2,"","",3.2765241599999995E-2,"","",3.2765241599999995E-2,"","",3.2765241599999995E-2,"","",3.2765241599999995E-2,"","",3.2765241599999995E-2,"","",3.2765241599999995E-2]
[null,null,null,"Transport jordmasser grøfterensk elektrisk/hydrogen",{"$f":"C126*'Drift og vedlikehold'!H15*Beregningsfaktorer!D85","v":0},"kWh",{"$f":"Beregningsfaktorer!D54","v":3},"Drift","Elektrisitet",{"$f":"Utslippsfaktorer!B24","v":"Elektrisitet 55 år, europeisk miks"},{"$f":"SUMIF(Utslippsfaktorer!B:B,Beregninger!J141,Utslippsfaktorer!D:D)","v":0.13600000000000001},{"$f":"VLOOKUP(J141,Utslippsfaktorer!B:C,2,FALSE)","v":"kg CO2e/kWh"},0,{"$f":"SUMIF($O$125:$BV$125,\"<=\" & 'Prosjektbeskrivelse og inndata'!$C$14,O141:BL141)","v":0},"","",0,"","",0,"","",0,"","",0,"","",0,"","",0,"","",0,"","",0,"","",0,"","",0,"","",0,"","",0,"","",0,"","",0,"","",0,"","",0,"","",0,"","",0,"","",0,"","",0]
[null,null,null,"Feiing diesel",{"$f":"C126*'Drift og vedlikehold'!E26*Beregningsfaktorer!D79","v":65.564999999999998},"liter diesel",1,"Drift","Diesel",{"$f":"Utslippsfaktorer!B20","v":"Fossil diesel (WTW)"},{"$f":"SUMIF(Utslippsfaktorer!B:B,Beregninger!J142,Utslippsfaktorer!D:D)","v":3.24},{"$f":"VLOOKUP(J142,Utslippsfaktorer!B:C,2,FALSE)","v":"kg CO2e/liter"},0.2124306,{"$f":"SUMIF($O$125:$BV$125,\"<=\" & 'Prosjektbeskrivelse og inndata'!$C$14,O142:BL142)","v":12.745835999999988},0.2124306,0.2124306,0.2124306,0.2124306,0.2124306,0.2124306,0.2124306,0.2124306,0.2124306,0.2124306,0.2124306,0.2124306,0.2124306,0.2124306,0.2124306,0.2124306,0.2124306,0.2124306,0.2124306,0.2124306,0.2124306,0.2124306,0.2124306,0.2124306,0.2124306,0.2124306,0.2124306,0.2124306,0.2124306,0.2124306,0.2124306,0.2124306,0.2124306,0.2124306,0.2124306,0.2124306,0.2124306,0.2124306,0.2124306,0.2124306,0.2124306,0.2124306,0.2124306,0.2124306,0.2124306,0.2124306,0.2124306,0.2124306,0.2124306,0.2124306,0.2124306,0.2124306,0.2124306,0.2124306,0.2124306,0.2124306,0.2124306,0.2124306,0.2124306,0.2124306]
[null,null,null,"Feiing biodiesel",{"$f":"C126*'Drift og vedlikehold'!F26*Beregningsfaktorer!D79","v":4.9350000000000005},"liter biodiesel",1,"Drift","Biodiesel",{"$f":"Utslippsfaktorer!B18","v":"Biodiesel (WTT)"},{"$f":"SUMIF(Utslippsfaktorer!B:B,Beregninger!J143,Utslippsfaktorer!D:D)","v":1.92},{"$f":"VLOOKUP(J143,Utslippsfaktorer!B:C,2,FALSE)","v":"kg CO2e/liter"},9.4752000000000013E-3,{"$f":"SUMIF($O$125:$BV$125,\"<=\" & 'Prosjektbeskrivelse og inndata'!$C$14,O143:BL143)","v":0.56851200000000046},9.4752000000000013E-3,9.4752000000000013E-3,9.4752000000000013E-3,9.4752000000000013E-3,9.4752000000000013E-3,9.4752000000000013E-3,9.4752000000000013E-3,9.4752000000000013E-3,9.4752000000000013E-3,9.4752000000000013E-3,9.4752000000000013E-3,9.4752000000000013E-3,9.4752000000000013E-3,9.4752000000000013E-3,9.4752000000000013E-3,9.4752000000000013E-3,9.4752000000000013E-3,9.4752000000000013E-3,9.4752000000000013E-3,9.4752000000000013E-3,9.4752000000000013E-3,9.4752000000000013E-3,9.4752000000000013E-3,9.4752000000000013E-3,9.4752000000000013E-3,9.4752000000000013E-3,9.4752000000000013E-3,9.4752000000000013E-3,9.4752000000000013E-3,9.4752000000000013E-3,9.4752000000000013E-3,9.4752000000000013E-3,9.4752000000000013E-3,9.4752000000000013E-3,9.4752000000000013E-3,9.4752000000000013E-3,9.4752000000000013E-3,9.4752000000000013E-3,9.4752000000000013E-3,9.4752000000000013E-3,9.4752000000000013E-3,9.4752000000000013E-3,9.4752000000000013E-3,9.4752000000000013E-3,9.4752000000000013E-3,9.4752000000000013E-3,9.4752000000000013E-3,9.4752000000000013E-3,9.4752000000000013E-3,9.4752000000000013E-3,9.4752000000000013E-3,9.4752000000000013E-3,9.4752000000000013E-3,9.4752000000000013E-3,9.4752000000000013E-3,9.4752000000000013E-3,9.4752000000000013E-3,9.4752000000000013E-3,9.4752000000000013E-3,9.4752000000000013E-3]
[null,null,null,"Feiing elektrisk/hydrogen",{"$f":"C126*'Drift og vedlikehold'!G26*Beregningsfaktorer!D79","v":0},"kWh",1,"Drift","Elektrisitet",{"$f":"Utslippsfaktorer!B24","v":"Elektrisitet 55 år, europeisk miks"},{"$f":"SUMIF(Utslippsfaktorer!B:B,Beregninger!J144,Utslippsfaktorer!D:D)","v":0.13600000000000001},{"$f":"VLOOKUP(J144,Utslippsfaktorer!B:C,2,FALSE)","v":"kg CO2e/kWh"},0,{"$f":"SUMIF($O$125:$BV$125,\"<=\" & 'Prosjektbeskrivelse og inndata'!$C$14,O144:BL144)","v":0},0,0,0,0,0,0,0,0,0,0,0,0,0,0,0,0,0,0,0,0,0,0,0,0,0,0,0,0,0,0,0,0,0,0,0,0,0,0,0,0,0,0,0,0,0,0,0,0,0,0,0,0,0,0,0,0,0,0,0,0]
[null,null,null,"Salting diesel",{"$f":"C126*'Drift og vedlikehold'!E27*(Beregningsfaktorer!D79/2)","v":559.48799999999994},"liter diesel",1,"Drift","Diesel",{"$f":"Utslippsfaktorer!B20","v":"Fossil diesel (WTW)"},{"$f":"SUMIF(Utslippsfaktorer!B:B,Beregninger!J145,Utslippsfaktorer!D:D)","v":3.24},{"$f":"VLOOKUP(J145,Utslippsfaktorer!B:C,2,FALSE)","v":"kg CO2e/liter"},1.8127411199999999,{"$f":"SUMIF($O$125:$BV$125,\"<=\" & 'Prosjektbeskrivelse og inndata'!$C$14,O145:BL145)","v":108.76446719999991},1.8127411199999999,1.8127411199999999,1.8127411199999999,1.8127411199999999,1.8127411199999999,1.8127411199999999,1.8127411199999999,1.8127411199999999,1.8127411199999999,1.8127411199999999,1.8127411199999999,1.8127411199999999,1.8127411199999999,1.8127411199999999,1.8127411199999999,1.8127411199999999,1.8127411199999999,1.8127411199999999,1.8127411199999999,1.8127411199999999,1.8127411199999999,1.8127411199999999,1.8127411199999999,1.8127411199999999,1.8127411199999999,1.8127411199999999,1.8127411199999999,1.8127411199999999,1.8127411199999999,1.8127411199999999,1.8127411199999999,1.8127411199999999,1.8127411199999999,1.8127411199999999,1.8127411199999999,1.8127411199999999,1.8127411199999999,1.8127411199999999,1.8127411199999999,1.8127411199999999,1.8127411199999999,1.8127411199999999,1.8127411199999999,1.8127411199999999,1.8127411199999999,1.8127411199999999,1.8127411199999999,1.8127411199999999,1.8127411199999999,1.8127411199999999,1.8127411199999999,1.8127411199999999,1.8127411199999999,1.8127411199999999,1.8127411199999999,1.8127411199999999,1.8127411199999999,1.8127411199999999,1.8127411199999999,1.8127411199999999]
[null,null,null,"Salting biodiesel",{"$f":"C126*'Drift og vedlikehold'!F27*(Beregningsfaktorer!D79/2)","v":42.112000000000002},"liter biodiesel",1,"Drift","Biodiesel",{"$f":"Utslippsfaktorer!B18","v":"Biodiesel (WTT)"},{"$f":"SUMIF(Utslippsfaktorer!B:B,Beregninger!J146,Utslippsfaktorer!D:D)","v":1.92},{"$f":"VLOOKUP(J146,Utslippsfaktorer!B:C,2,FALSE)","v":"kg CO2e/liter"},8.0855040000000003E-2,{"$f":"SUMIF($O$125:$BV$125,\"<=\" & 'Prosjektbeskrivelse og inndata'!$C$14,O146:BL146)","v":4.8513024000000016},{"$f":"IF(MOD(O$125,$G146)=0,$M146,\"\")","v":8.0855040000000003E-2},8.0855040000000003E-2,8.0855040000000003E-2,8.0855040000000003E-2,8.0855040000000003E-2,8.0855040000000003E-2,8.0855040000000003E-2,8.0855040000000003E-2,8.0855040000000003E-2,8.0855040000000003E-2,{"$f":"IF(MOD(Y$125,$G146)=0,$M146,\"\")","v":8.0855040000000003E-2},8.0855040000000003E-2,8.0855040000000003E-2,8.0855040000000003E-2,8.0855040000000003E-2,8.0855040000000003E-2,8.0855040000000003E-2,8.0855040000000003E-2,8.0855040000000003E-2,8.0855040000000003E-2,{"$f":"IF(MOD(AI$125,$G146)=0,$M146,\"\")","v":8.0855040000000003E-2},8.0855040000000003E-2,8.0855040000000003E-2,8.0855040000000003E-2,8.0855040000000003E-2,8.0855040000000003E-2,8.0855040000000003E-2,8.0855040000000003E-2,8.0855040000000003E-2,8.0855040000000003E-2,{"$f":"IF(MOD(AS$125,$G146)=0,$M146,\"\")","v":8.0855040000000003E-2},8.0855040000000003E-2,8.0855040000000003E-2,8.0855040000000003E-2,8.0855040000000003E-2,8.0855040000000003E-2,8.0855040000000003E-2,8.0855040000000003E-2,8.0855040000000003E-2,8.0855040000000003E-2,{"$f":"IF(MOD(BC$125,$G146)=0,$M146,\"\")","v":8.0855040000000003E-2},8.0855040000000003E-2,8.0855040000000003E-2,8.0855040000000003E-2,8.0855040000000003E-2,8.0855040000000003E-2,8.0855040000000003E-2,8.0855040000000003E-2,8.0855040000000003E-2,8.0855040000000003E-2,{"$f":"IF(MOD(BM$125,$G146)=0,$M146,\"\")","v":8.0855040000000003E-2},8.0855040000000003E-2,8.0855040000000003E-2,8.0855040000000003E-2,8.0855040000000003E-2,8.0855040000000003E-2,8.0855040000000003E-2,8.0855040000000003E-2,8.0855040000000003E-2,8.0855040000000003E-2]
[null,null,null,"Salting elektrisk/hydrogen",{"$f":"C126*'Drift og vedlikehold'!G27*(Beregningsfaktorer!D79/2)","v":0},"kWh",1,"Drift","Elektrisitet",{"$f":"Utslippsfaktorer!B24","v":"Elektrisitet 55 år, europeisk miks"},{"$f":"SUMIF(Utslippsfaktorer!B:B,Beregninger!J147,Utslippsfaktorer!D:D)","v":0.13600000000000001},{"$f":"VLOOKUP(J147,Utslippsfaktorer!B:C,2,FALSE)","v":"kg CO2e/kWh"},0,{"$f":"SUMIF($O$125:$BV$125,\"<=\" & 'Prosjektbeskrivelse og inndata'!$C$14,O147:BL147)","v":0},0,0,0,0,0,0,0,0,0,0,0,0,0,0,0,0,0,0,0,0,0,0,0,0,0,0,0,0,0,0,0,0,0,0,0,0,0,0,0,0,0,0,0,0,0,0,0,0,0,0,0,0,0,0,0,0,0,0,0,0]
[null,null,null,"Salt",{"$f":"C126*'Drift og vedlikehold'!E16","v":49350},"kg salt",1,"Drift","Salt",{"$f":"Utslippsfaktorer!B12","v":"Salt"},{"$f":"SUMIF(Utslippsfaktorer!B:B,Beregninger!J148,Utslippsfaktorer!D:D)","v":0.17899999999999999},{"$f":"VLOOKUP(J148,Utslippsfaktorer!B:C,2,FALSE)","v":"kg CO2e/kg"},8.8336500000000004,{"$f":"SUMIF($O$125:$BV$125,\"<=\" & 'Prosjektbeskrivelse og inndata'!$C$14,O148:BL148)","v":530.01899999999955},8.8336500000000004,8.8336500000000004,8.8336500000000004,8.8336500000000004,8.8336500000000004,8.8336500000000004,8.8336500000000004,8.8336500000000004,8.8336500000000004,8.8336500000000004,8.8336500000000004,8.8336500000000004,8.8336500000000004,8.8336500000000004,8.8336500000000004,8.8336500000000004,8.8336500000000004,8.8336500000000004,8.8336500000000004,8.8336500000000004,8.8336500000000004,8.8336500000000004,8.8336500000000004,8.8336500000000004,8.8336500000000004,8.8336500000000004,8.8336500000000004,8.8336500000000004,8.8336500000000004,8.8336500000000004,8.8336500000000004,8.8336500000000004,8.8336500000000004,8.8336500000000004,8.8336500000000004,8.8336500000000004,8.8336500000000004,8.8336500000000004,8.8336500000000004,8.8336500000000004,8.8336500000000004,8.8336500000000004,8.8336500000000004,8.8336500000000004,8.8336500000000004,8.8336500000000004,8.8336500000000004,8.8336500000000004,8.8336500000000004,8.8336500000000004,8.8336500000000004,8.8336500000000004,8.8336500000000004,8.8336500000000004,8.8336500000000004,8.8336500000000004,8.8336500000000004,8.8336500000000004,8.8336500000000004,8.8336500000000004]
[null,null,null,"Salttransport diesel",{"$f":"C126*'Drift og vedlikehold'!F16","v":458.95499999999993},"liter diesel",1,"Drift","Diesel",{"$f":"Utslippsfaktorer!B20","v":"Fossil diesel (WTW)"},{"$f":"SUMIF(Utslippsfaktorer!B:B,Beregninger!J149,Utslippsfaktorer!D:D)","v":3.24},{"$f":"VLOOKUP(J149,Utslippsfaktorer!B:C,2,FALSE)","v":"kg CO2e/liter"},1.4870142,{"$f":"SUMIF($O$125:$BV$125,\"<=\" & 'Prosjektbeskrivelse og inndata'!$C$14,O149:BL149)","v":89.220852000000022},1.4870142,1.4870142,1.4870142,1.4870142,1.4870142,1.4870142,1.4870142,1.4870142,1.4870142,1.4870142,1.4870142,1.4870142,1.4870142,1.4870142,1.4870142,1.4870142,1.4870142,1.4870142,1.4870142,1.4870142,1.4870142,1.4870142,1.4870142,1.4870142,1.4870142,1.4870142,1.4870142,1.4870142,1.4870142,1.4870142,1.4870142,1.4870142,1.4870142,1.4870142,1.4870142,1.4870142,1.4870142,1.4870142,1.4870142,1.4870142,1.4870142,1.4870142,1.4870142,1.4870142,1.4870142,1.4870142,1.4870142,1.4870142,1.4870142,1.4870142,1.4870142,1.4870142,1.4870142,1.4870142,1.4870142,1.4870142,1.4870142,1.4870142,1.4870142,1.4870142]
[null,null,null,"Salttransport biodiesel",{"$f":"C126*'Drift og vedlikehold'!G16","v":34.545000000000002},"liter biodiesel",1,"Drift","Biodiesel",{"$f":"Utslippsfaktorer!B18","v":"Biodiesel (WTT)"},{"$f":"SUMIF(Utslippsfaktorer!B:B,Beregninger!J150,Utslippsfaktorer!D:D)","v":1.92},{"$f":"VLOOKUP(J150,Utslippsfaktorer!B:C,2,FALSE)","v":"kg CO2e/liter"},6.6326400000000008E-2,{"$f":"SUMIF($O$125:$BV$125,\"<=\" & 'Prosjektbeskrivelse og inndata'!$C$14,O150:BL150)","v":3.9795839999999956},6.6326400000000008E-2,6.6326400000000008E-2,6.6326400000000008E-2,6.6326400000000008E-2,6.6326400000000008E-2,6.6326400000000008E-2,6.6326400000000008E-2,6.6326400000000008E-2,6.6326400000000008E-2,6.6326400000000008E-2,6.6326400000000008E-2,6.6326400000000008E-2,6.6326400000000008E-2,6.6326400000000008E-2,6.6326400000000008E-2,6.6326400000000008E-2,6.6326400000000008E-2,6.6326400000000008E-2,6.6326400000000008E-2,6.6326400000000008E-2,6.6326400000000008E-2,6.6326400000000008E-2,6.6326400000000008E-2,6.6326400000000008E-2,6.6326400000000008E-2,6.6326400000000008E-2,6.6326400000000008E-2,6.6326400000000008E-2,6.6326400000000008E-2,6.6326400000000008E-2,6.6326400000000008E-2,6.6326400000000008E-2,6.6326400000000008E-2,6.6326400000000008E-2,6.6326400000000008E-2,6.6326400000000008E-2,6.6326400000000008E-2,6.6326400000000008E-2,6.6326400000000008E-2,6.6326400000000008E-2,6.6326400000000008E-2,6.6326400000000008E-2,6.6326400000000008E-2,6.6326400000000008E-2,6.6326400000000008E-2,6.6326400000000008E-2,6.6326400000000008E-2,6.6326400000000008E-2,6.6326400000000008E-2,6.6326400000000008E-2,6.6326400000000008E-2,6.6326400000000008E-2,6.6326400000000008E-2,6.6326400000000008E-2,6.6326400000000008E-2,6.6326400000000008E-2,6.6326400000000008E-2,6.6326400000000008E-2,6.6326400000000008E-2,6.6326400000000008E-2]
[null,null,null,"Salttransport elektrisk/hydrogen",{"$f":"C126*'Drift og vedlikehold'!H16","v":0},"kWh",1,"Drift","Elektrisitet",{"$f":"Utslippsfaktorer!B24","v":"Elektrisitet 55 år, europeisk miks"},{"$f":"SUMIF(Utslippsfaktorer!B:B,Beregninger!J151,Utslippsfaktorer!D:D)","v":0.13600000000000001},{"$f":"VLOOKUP(J151,Utslippsfaktorer!B:C,2,FALSE)","v":"kg CO2e/kWh"},0,{"$f":"SUMIF($O$125:$BV$125,\"<=\" & 'Prosjektbeskrivelse og inndata'!$C$14,O151:BL151)","v":0},0,0,0,0,0,0,0,0,0,0,0,0,0,0,0,0,0,0,0,0,0,0,0,0,0,0,0,0,0,0,0,0,0,0,0,0,0,0,0,0,0,0,0,0,0,0,0,0,0,0,0,0,0,0,0,0,0,0,0,0]
[null,null,null,"Brøyting diesel",{"$f":"C126*'Drift og vedlikehold'!E28","v":2027.3047680000002},"liter diesel",1,"Drift","Diesel",{"$f":"Utslippsfaktorer!B20","v":"Fossil diesel (WTW)"},{"$f":"SUMIF(Utslippsfaktorer!B:B,Beregninger!J152,Utslippsfaktorer!D:D)","v":3.24},{"$f":"VLOOKUP(J152,Utslippsfaktorer!B:C,2,FALSE)","v":"kg CO2e/liter"},6.5684674483200016,{"$f":"SUMIF($O$125:$BV$125,\"<=\" & 'Prosjektbeskrivelse og inndata'!$C$14,O152:BL152)","v":394.10804689920036},6.5684674483200016,6.5684674483200016,6.5684674483200016,6.5684674483200016,6.5684674483200016,6.5684674483200016,6.5684674483200016,6.5684674483200016,6.5684674483200016,6.5684674483200016,6.5684674483200016,6.5684674483200016,6.5684674483200016,6.5684674483200016,6.5684674483200016,6.5684674483200016,6.5684674483200016,6.5684674483200016,6.5684674483200016,6.5684674483200016,6.5684674483200016,6.5684674483200016,6.5684674483200016,6.5684674483200016,6.5684674483200016,6.5684674483200016,6.5684674483200016,6.5684674483200016,6.5684674483200016,6.5684674483200016,6.5684674483200016,6.5684674483200016,6.5684674483200016,6.5684674483200016,6.5684674483200016,6.5684674483200016,6.5684674483200016,6.5684674483200016,6.5684674483200016,6.5684674483200016,6.5684674483200016,6.5684674483200016,6.5684674483200016,6.5684674483200016,6.5684674483200016,6.5684674483200016,6.5684674483200016,6.5684674483200016,6.5684674483200016,6.5684674483200016,6.5684674483200016,6.5684674483200016,6.5684674483200016,6.5684674483200016,6.5684674483200016,6.5684674483200016,6.5684674483200016,6.5684674483200016,6.5684674483200016,6.5684674483200016]
[null,null,null,"Brøyting biodiesel",{"$f":"C126*'Drift og vedlikehold'!F28","v":152.59283200000002},"liter biodiesel",1,"Drift","Biodiesel",{"$f":"Utslippsfaktorer!B18","v":"Biodiesel (WTT)"},{"$f":"SUMIF(Utslippsfaktorer!B:B,Beregninger!J153,Utslippsfaktorer!D:D)","v":1.92},{"$f":"VLOOKUP(J153,Utslippsfaktorer!B:C,2,FALSE)","v":"kg CO2e/liter"},0.29297823744000007,{"$f":"SUMIF($O$125:$BV$125,\"<=\" & 'Prosjektbeskrivelse og inndata'!$C$14,O153:BL153)","v":17.578694246399994},0.29297823744000007,0.29297823744000007,0.29297823744000007,0.29297823744000007,0.29297823744000007,0.29297823744000007,0.29297823744000007,0.29297823744000007,0.29297823744000007,0.29297823744000007,0.29297823744000007,0.29297823744000007,0.29297823744000007,0.29297823744000007,0.29297823744000007,0.29297823744000007,0.29297823744000007,0.29297823744000007,0.29297823744000007,0.29297823744000007,0.29297823744000007,0.29297823744000007,0.29297823744000007,0.29297823744000007,0.29297823744000007,0.29297823744000007,0.29297823744000007,0.29297823744000007,0.29297823744000007,0.29297823744000007,0.29297823744000007,0.29297823744000007,0.29297823744000007,0.29297823744000007,0.29297823744000007,0.29297823744000007,0.29297823744000007,0.29297823744000007,0.29297823744000007,0.29297823744000007,0.29297823744000007,0.29297823744000007,0.29297823744000007,0.29297823744000007,0.29297823744000007,0.29297823744000007,0.29297823744000007,0.29297823744000007,0.29297823744000007,0.29297823744000007,0.29297823744000007,0.29297823744000007,0.29297823744000007,0.29297823744000007,0.29297823744000007,0.29297823744000007,0.29297823744000007,0.29297823744000007,0.29297823744000007,0.29297823744000007]
[null,null,null,"Brøyting elektrisk/hydrogen",{"$f":"C126*'Drift og vedlikehold'!G28","v":0},"kWh",1,"Drift","Elektrisitet",{"$f":"Utslippsfaktorer!B24","v":"Elektrisitet 55 år, europeisk miks"},{"$f":"SUMIF(Utslippsfaktorer!B:B,Beregninger!J154,Utslippsfaktorer!D:D)","v":0.13600000000000001},{"$f":"VLOOKUP(J154,Utslippsfaktorer!B:C,2,FALSE)","v":"kg CO2e/kWh"},0,{"$f":"SUMIF($O$125:$BV$125,\"<=\" & 'Prosjektbeskrivelse og inndata'!$C$14,O154:BL154)","v":0},0,0,0,0,0,0,0,0,0,0,0,0,0,0,0,0,0,0,0,0,0,0,0,0,0,0,0,0,0,0,0,0,0,0,0,0,0,0,0,0,0,0,0,0,0,0,0,0,0,0,0,0,0,0,0,0,0,0,0,0]
[null,null,null,"Autovern",{"$f":"C126*'Tillegg vei'!D7*Beregningsfaktorer!D83","v":310200},"kg stål",{"$f":"Beregningsfaktorer!D51","v":30},"Vedlikehold","Stål",{"$f":"Utslippsfaktorer!B14","v":"Stål"},{"$f":"SUMIF(Utslippsfaktorer!B:B,Beregninger!J155,Utslippsfaktorer!D:D)","v":2.1234999999999999},{"$f":"VLOOKUP(J155,Utslippsfaktorer!B:C,2,FALSE)","v":"kg CO2e/kg"},658.7097,{"$f":"SUMIF($O$125:$BV$125,\"<=\" & 'Prosjektbeskrivelse og inndata'!$C$14,O155:BL155)","v":1317.4194},"","","","","","","","","","","","","","","","","","","","","","","","","","","","","",658.7097,"","","","","","","","","","","","","","","","","","","","","","","","","","","","","",658.7097]
[null,null,null,"Utskiftning autovern diesel",{"$f":"C126*'Tillegg vei'!E7*Beregningsfaktorer!D83","v":2307.8879999999999},"liter diesel",{"$f":"Beregningsfaktorer!D51","v":30},"Vedlikehold","Diesel",{"$f":"Utslippsfaktorer!B20","v":"Fossil diesel (WTW)"},{"$f":"SUMIF(Utslippsfaktorer!B:B,Beregninger!J156,Utslippsfaktorer!D:D)","v":3.24},{"$f":"VLOOKUP(J156,Utslippsfaktorer!B:C,2,FALSE)","v":"kg CO2e/liter"},7.4775571200000002,{"$f":"SUMIF($O$125:$BV$125,\"<=\" & 'Prosjektbeskrivelse og inndata'!$C$14,O156:BL156)","v":14.95511424},{"$f":"IF(MOD(O$125,$G156)=0,$M156,\"\")","v":""},"","","","","","","","","",{"$f":"IF(MOD(Y$125,$G156)=0,$M156,\"\")","v":""},"","","","","","","","","",{"$f":"IF(MOD(AI$125,$G156)=0,$M156,\"\")","v":""},"","","","","","","","",7.4775571200000002,{"$f":"IF(MOD(AS$125,$G156)=0,$M156,\"\")","v":""},"","","","","","","","","",{"$f":"IF(MOD(BC$125,$G156)=0,$M156,\"\")","v":""},"","","","","","","","","",{"$f":"IF(MOD(BM$125,$G156)=0,$M156,\"\")","v":""},"","","","","","","","",7.4775571200000002]
[null,null,null,"Utskiftning autovern biodiesel",{"$f":"C126*'Tillegg vei'!F7*Beregningsfaktorer!D83","v":173.71200000000002},"liter biodiesel",{"$f":"Beregningsfaktorer!D51","v":30},"Vedlikehold","Biodiesel",{"$f":"Utslippsfaktorer!B18","v":"Biodiesel (WTT)"},{"$f":"SUMIF(Utslippsfaktorer!B:B,Beregninger!J157,Utslippsfaktorer!D:D)","v":1.92},{"$f":"VLOOKUP(J157,Utslippsfaktorer!B:C,2,FALSE)","v":"kg CO2e/liter"},0.33352704,{"$f":"SUMIF($O$125:$BV$125,\"<=\" & 'Prosjektbeskrivelse og inndata'!$C$14,O157:BL157)","v":0.66705407999999999},"","","","","","","","","","","","","","","","","","","","","","","","","","","","","",0.33352704,"","","","","","","","","","","","","","","","","","","","","","","","","","","","","",0.33352704]
[null,null,null,"Utskiftning autovern elektrisk/hydrogen",{"$f":"C126*'Tillegg vei'!G7*Beregningsfaktorer!D83","v":0},"kWh",{"$f":"Beregningsfaktorer!D51","v":30},"Vedlikehold","Elektrisitet",{"$f":"Utslippsfaktorer!B24","v":"Elektrisitet 55 år, europeisk miks"},{"$f":"SUMIF(Utslippsfaktorer!B:B,Beregninger!J158,Utslippsfaktorer!D:D)","v":0.13600000000000001},{"$f":"VLOOKUP(J158,Utslippsfaktorer!B:C,2,FALSE)","v":"kg CO2e/kWh"},0,{"$f":"SUMIF($O$125:$BV$125,\"<=\" & 'Prosjektbeskrivelse og inndata'!$C$14,O158:BL158)","v":0},"","","","","","","","","","","","","","","","","","","","","","","","","","","","","",0,"","","","","","","","","","","","","","","","","","","","","","","","","","","","","",0]
[null,null,null,"Transport av autovern diesel",{"$f":"C126*'Drift og vedlikehold'!F19*Beregningsfaktorer!D83","v":2307.8879999999999},"liter diesel",{"$f":"Beregningsfaktorer!D51","v":30},"Vedlikehold","Diesel",{"$f":"Utslippsfaktorer!B20","v":"Fossil diesel (WTW)"},{"$f":"SUMIF(Utslippsfaktorer!B:B,Beregninger!J159,Utslippsfaktorer!D:D)","v":3.24},{"$f":"VLOOKUP(J159,Utslippsfaktorer!B:C,2,FALSE)","v":"kg CO2e/liter"},{"$f":"(E159*K159)/1000","v":7.4775571200000002},{"$f":"SUMIF($O$125:$BV$125,\"<=\" & 'Prosjektbeskrivelse og inndata'!$C$14,O159:BL159)","v":14.95511424},"","","","","","","","","","","","","","","","","","","","","","","","","","","","","",7.4775571200000002,"","","","","","","","","","","","","","","","","","","","","","","","","","","","","",7.4775571200000002]
[null,null,null,"Transport av autovern biodiesel",{"$f":"C126*'Drift og vedlikehold'!G19*Beregningsfaktorer!D83","v":173.71200000000002},"liter biodiesel",{"$f":"Beregningsfaktorer!D51","v":30},"Vedlikehold","Biodiesel",{"$f":"Utslippsfaktorer!B18","v":"Biodiesel (WTT)"},{"$f":"SUMIF(Utslippsfaktorer!B:B,Beregninger!J160,Utslippsfaktorer!D:D)","v":1.92},{"$f":"VLOOKUP(J160,Utslippsfaktorer!B:C,2,FALSE)","v":"kg CO2e/liter"},0.33352704,{"$f":"SUMIF($O$125:$BV$125,\"<=\" & 'Prosjektbeskrivelse og inndata'!$C$14,O160:BL160)","v":0.66705407999999999},"","","","","","","","","","","","","","","","","","","","","","","","","","","","","",0.33352704,"","","","","","","","","","","","","","","","","","","","","","","","","","","","","",0.33352704]
[null,null,null,"Transport av autovern elektrisk/hydrogen",{"$f":"C126*'Drift og vedlikehold'!H19*Beregningsfaktorer!D83","v":0},"kWh",{"$f":"Beregningsfaktorer!D51","v":30},"Vedlikehold","Elektrisitet",{"$f":"Utslippsfaktorer!B24","v":"Elektrisitet 55 år, europeisk miks"},{"$f":"SUMIF(Utslippsfaktorer!B:B,Beregninger!J161,Utslippsfaktorer!D:D)","v":0.13600000000000001},{"$f":"VLOOKUP(J161,Utslippsfaktorer!B:C,2,FALSE)","v":"kg CO2e/kWh"},0,{"$f":"SUMIF($O$125:$BV$125,\"<=\" & 'Prosjektbeskrivelse og inndata'!$C$14,O161:BL161)","v":0},"","","","","","","","","","","","","","","","","","","","","","","","","","","","","",0,"","","","","","","","","","","","","","","","","","","","","","","","","","","","","",0]
[null,null,null,"Lyktestolper",{"$f":"C126*'Tillegg vei'!D5*Beregningsfaktorer!D81","v":45343.250000000007},"kg stål",{"$f":"Beregningsfaktorer!D52","v":30},"Vedlikehold","Stål",{"$f":"Utslippsfaktorer!B14","v":"Stål"},{"$f":"SUMIF(Utslippsfaktorer!B:B,Beregninger!J162,Utslippsfaktorer!D:D)","v":2.1234999999999999},{"$f":"VLOOKUP(J162,Utslippsfaktorer!B:C,2,FALSE)","v":"kg CO2e/kg"},96.286391375000008,{"$f":"SUMIF($O$125:$BV$125,\"<=\" & 'Prosjektbeskrivelse og inndata'!$C$14,O162:BL162)","v":192.57278275000002},"","","","","","","","","","","","","","","","","","","","","","","","","","","","","",96.286391375000008,"","","","","","","","","","","","","","","","","","","","","","","","","","","","","",96.286391375000008]
[null,null,null,"Transport av lyktestolper diesel",{"$f":"C126*'Drift og vedlikehold'!F17*Beregningsfaktorer!D81","v":337.35378000000003},"liter diesel",{"$f":"Beregningsfaktorer!D52","v":30},"Vedlikehold","Diesel",{"$f":"Utslippsfaktorer!B20","v":"Fossil diesel (WTW)"},{"$f":"SUMIF(Utslippsfaktorer!B:B,Beregninger!J163,Utslippsfaktorer!D:D)","v":3.24},{"$f":"VLOOKUP(J163,Utslippsfaktorer!B:C,2,FALSE)","v":"kg CO2e/liter"},1.0930262472000001,{"$f":"SUMIF($O$125:$BV$125,\"<=\" & 'Prosjektbeskrivelse og inndata'!$C$14,O163:BL163)","v":2.1860524944000002},"","","","","","","","","","","","","","","","","","","","","","","","","","","","","",1.0930262472000001,"","","","","","","","","","","","","","","","","","","","","","","","","","","","","",1.0930262472000001]
[null,null,null,"Transport av lyktestolper biodiesel",{"$f":"C126*'Drift og vedlikehold'!G17*Beregningsfaktorer!D81","v":25.392220000000005},"liter biodiesel",{"$f":"Beregningsfaktorer!D52","v":30},"Vedlikehold","Biodiesel",{"$f":"Utslippsfaktorer!B18","v":"Biodiesel (WTT)"},{"$f":"SUMIF(Utslippsfaktorer!B:B,Beregninger!J164,Utslippsfaktorer!D:D)","v":1.92},{"$f":"VLOOKUP(J164,Utslippsfaktorer!B:C,2,FALSE)","v":"kg CO2e/liter"},4.8753062400000012E-2,{"$f":"SUMIF($O$125:$BV$125,\"<=\" & 'Prosjektbeskrivelse og inndata'!$C$14,O164:BL164)","v":9.7506124800000024E-2},"","","","","","","","","","","","","","","","","","","","","","","","","","","","","",4.8753062400000012E-2,"","","","","","","","","","","","","","","","","","","","","","","","","","","","","",4.8753062400000012E-2]
[null,null,null,"Transport av lyktestolper elektrisk/hydrogen",{"$f":"C126*'Drift og vedlikehold'!H17*Beregningsfaktorer!D81","v":0},"kWh",{"$f":"Beregningsfaktorer!D52","v":30},"Vedlikehold","Elektrisitet",{"$f":"Utslippsfaktorer!B24","v":"Elektrisitet 55 år, europeisk miks"},{"$f":"SUMIF(Utslippsfaktorer!B:B,Beregninger!J165,Utslippsfaktorer!D:D)","v":0.13600000000000001},{"$f":"VLOOKUP(J165,Utslippsfaktorer!B:C,2,FALSE)","v":"kg CO2e/kWh"},0,{"$f":"SUMIF($O$125:$BV$125,\"<=\" & 'Prosjektbeskrivelse og inndata'!$C$14,O165:BL165)","v":0},"","","","","","","","","","","","","","","","","","","","","","","","","","","","","",0,"","","","","","","","","","","","","","","","","","","","","","","","","","","","","",0]
[null,null,null,"Belysning vei i dagen",{"$f":"C126*'Drift og vedlikehold'!H8*Beregningsfaktorer!D81","v":319600},"kWh",1,"Drift","Elektrisitet",{"$f":"Utslippsfaktorer!B24","v":"Elektrisitet 55 år, europeisk miks"},{"$f":"SUMIF(Utslippsfaktorer!B:B,Beregninger!J166,Utslippsfaktorer!D:D)","v":0.13600000000000001},{"$f":"VLOOKUP(J166,Utslippsfaktorer!B:C,2,FALSE)","v":"kg CO2e/kWh"},43.465600000000009,{"$f":"SUMIF($O$125:$BV$125,\"<=\" & 'Prosjektbeskrivelse og inndata'!$C$14,O166:BL166)","v":2607.9360000000001},{"$f":"IF(MOD(O$125,$G166)=0,$M166,\"\")","v":43.465600000000009},43.465600000000009,43.465600000000009,43.465600000000009,43.465600000000009,43.465600000000009,43.465600000000009,43.465600000000009,43.465600000000009,43.465600000000009,{"$f":"IF(MOD(Y$125,$G166)=0,$M166,\"\")","v":43.465600000000009},43.465600000000009,43.465600000000009,43.465600000000009,43.465600000000009,43.465600000000009,43.465600000000009,43.465600000000009,43.465600000000009,43.465600000000009,{"$f":"IF(MOD(AI$125,$G166)=0,$M166,\"\")","v":43.465600000000009},43.465600000000009,43.465600000000009,43.465600000000009,43.465600000000009,43.465600000000009,43.465600000000009,43.465600000000009,43.465600000000009,43.465600000000009,{"$f":"IF(MOD(AS$125,$G166)=0,$M166,\"\")","v":43.465600000000009},43.465600000000009,43.465600000000009,43.465600000000009,43.465600000000009,43.465600000000009,43.465600000000009,43.465600000000009,43.465600000000009,43.465600000000009,{"$f":"IF(MOD(BC$125,$G166)=0,$M166,\"\")","v":43.465600000000009},43.465600000000009,43.465600000000009,43.465600000000009,43.465600000000009,43.465600000000009,43.465600000000009,43.465600000000009,43.465600000000009,43.465600000000009,{"$f":"IF(MOD(BM$125,$G166)=0,$M166,\"\")","v":43.465600000000009},43.465600000000009,43.465600000000009,43.465600000000009,43.465600000000009,43.465600000000009,43.465600000000009,43.465600000000009,43.465600000000009,43.465600000000009]
[null,"Drift sidevei (m)",{"$f":"SUMIF('Prosjektbeskrivelse og inndata'!$M:$M,B43,'Prosjektbeskrivelse og inndata'!$L:$L)","v":600},"Asfalt til reasfaltering",{"$f":"C167*'Prosjektbeskrivelse og inndata'!C10*Reasfaltering!D9","v":182250},"kg asfaltgrusbetong",{"$f":"Beregningsfaktorer!D50","v":7},"Reasfaltering","Asfalt",{"$f":"Utslippsfaktorer!B6","v":"Asfaltgrusbetong (Agb)"},{"$f":"SUMIF(Utslippsfaktorer!B:B,Beregninger!J167,Utslippsfaktorer!D:D)","v":5.1200000000000002E-2},{"$f":"VLOOKUP(J167,Utslippsfaktorer!B:C,2,FALSE)","v":"kg CO2e/kg"},9.3312000000000008,{"$f":"SUMIF($O$125:$BV$125,\"<=\" & 'Prosjektbeskrivelse og inndata'!$C$14,O167:BL167)","v":74.649600000000007},"","","","","","",9.3312000000000008,"","","","","","",9.3312000000000008,"","","","","","",9.3312000000000008,"","","","","","",9.3312000000000008,"","","","","","",9.3312000000000008,"","","","","","",9.3312000000000008,"","","","","","",9.3312000000000008,"","","","","","",9.3312000000000008,"","","",""]
[null,null,null,"Transport av asfalt diesel",{"$f":"C167*'Prosjektbeskrivelse og inndata'!C10*Reasfaltering!E9","v":101.6955},"liter diesel",{"$f":"Beregningsfaktorer!D50","v":7},"Reasfaltering","Diesel",{"$f":"Utslippsfaktorer!B20","v":"Fossil diesel (WTW)"},{"$f":"SUMIF(Utslippsfaktorer!B:B,Beregninger!J168,Utslippsfaktorer!D:D)","v":3.24},{"$f":"VLOOKUP(J168,Utslippsfaktorer!B:C,2,FALSE)","v":"kg CO2e/liter"},0.32949342000000004,{"$f":"SUMIF($O$125:$BV$125,\"<=\" & 'Prosjektbeskrivelse og inndata'!$C$14,O168:BL168)","v":2.6359473599999999},"","","","","","",0.32949342000000004,"","","","","","",0.32949342000000004,"","","","","","",0.32949342000000004,"","","","","","",0.32949342000000004,"","","","","","",0.32949342000000004,"","","","","","",0.32949342000000004,"","","","","","",0.32949342000000004,"","","","","","",0.32949342000000004,"","","",""]
[null,null,null,"Transport av asfalt biodiesel",{"$f":"C167*'Prosjektbeskrivelse og inndata'!C10*Reasfaltering!F9","v":7.6545000000000005},"liter biodiesel",{"$f":"Beregningsfaktorer!D50","v":7},"Reasfaltering","Biodiesel",{"$f":"Utslippsfaktorer!B18","v":"Biodiesel (WTT)"},{"$f":"SUMIF(Utslippsfaktorer!B:B,Beregninger!J169,Utslippsfaktorer!D:D)","v":1.92},{"$f":"VLOOKUP(J169,Utslippsfaktorer!B:C,2,FALSE)","v":"kg CO2e/liter"},1.469664E-2,{"$f":"SUMIF($O$125:$BV$125,\"<=\" & 'Prosjektbeskrivelse og inndata'!$C$14,O169:BL169)","v":0.11757311999999999},"","","","","","",1.469664E-2,"","","","","","",1.469664E-2,"","","","","","",1.469664E-2,"","","","","","",1.469664E-2,"","","","","","",1.469664E-2,"","","","","","",1.469664E-2,"","","","","","",1.469664E-2,"","","","","","",1.469664E-2,"","","",""]
[null,null,null,"Transport av asfalt elektrisk/hydrogen",{"$f":"C167*'Prosjektbeskrivelse og inndata'!C10*Reasfaltering!G9","v":0},"kWh",{"$f":"Beregningsfaktorer!D50","v":7},"Reasfaltering","Elektrisitet",{"$f":"Utslippsfaktorer!B24","v":"Elektrisitet 55 år, europeisk miks"},{"$f":"SUMIF(Utslippsfaktorer!B:B,Beregninger!J170,Utslippsfaktorer!D:D)","v":0.13600000000000001},{"$f":"VLOOKUP(J170,Utslippsfaktorer!B:C,2,FALSE)","v":"kg CO2e/kWh"},0,{"$f":"SUMIF($O$125:$BV$125,\"<=\" & 'Prosjektbeskrivelse og inndata'!$C$14,O170:BL170)","v":0},"","","","","","",0,"","","","","","",0,"","","","","","",0,"","","","","","",0,"","","","","","",0,"","","","","","",0,"","","","","","",0,"","","","","","",0,"","","",""]
[null,null,null,"Reasfaltering diesel",{"$f":"C167*'Prosjektbeskrivelse og inndata'!C10*Reasfaltering!E9","v":101.6955},"liter diesel",{"$f":"Beregningsfaktorer!D50","v":7},"Reasfaltering","Diesel",{"$f":"Utslippsfaktorer!B20","v":"Fossil diesel (WTW)"},{"$f":"SUMIF(Utslippsfaktorer!B:B,Beregninger!J171,Utslippsfaktorer!D:D)","v":3.24},{"$f":"VLOOKUP(J171,Utslippsfaktorer!B:C,2,FALSE)","v":"kg CO2e/liter"},0.32949342000000004,{"$f":"SUMIF($O$125:$BV$125,\"<=\" & 'Prosjektbeskrivelse og inndata'!$C$14,O171:BL171)","v":2.6359473599999999},"","","","","","",0.32949342000000004,"","","","","","",0.32949342000000004,"","","","","","",0.32949342000000004,"","","","","","",0.32949342000000004,"","","","","","",0.32949342000000004,"","","","","","",0.32949342000000004,"","","","","","",0.32949342000000004,"","","","","","",0.32949342000000004,"","","",""]
[null,null,null,"Reasfaltering biodiesel",{"$f":"C167*'Prosjektbeskrivelse og inndata'!C10*Reasfaltering!F9","v":7.6545000000000005},"liter biodiesel",{"$f":"Beregningsfaktorer!D50","v":7},"Reasfaltering","Biodiesel",{"$f":"Utslippsfaktorer!B18","v":"Biodiesel (WTT)"},{"$f":"SUMIF(Utslippsfaktorer!B:B,Beregninger!J172,Utslippsfaktorer!D:D)","v":1.92},{"$f":"VLOOKUP(J172,Utslippsfaktorer!B:C,2,FALSE)","v":"kg CO2e/liter"},1.469664E-2,{"$f":"SUMIF($O$125:$BV$125,\"<=\" & 'Prosjektbeskrivelse og inndata'!$C$14,O172:BL172)","v":0.11757311999999999},"","","","","","",1.469664E-2,"","","","","","",1.469664E-2,"","","","","","",1.469664E-2,"","","","","","",1.469664E-2,"","","","","","",1.469664E-2,"","","","","","",1.469664E-2,"","","","","","",1.469664E-2,"","","","","","",1.469664E-2,"","","",""]
[null,null,null,"Reasfaltering elektrisk/hydrogen",{"$f":"C167*'Prosjektbeskrivelse og inndata'!C10*Reasfaltering!G9","v":0},"kWh",{"$f":"Beregningsfaktorer!D50","v":7},"Reasfaltering","Elektrisitet",{"$f":"Utslippsfaktorer!B24","v":"Elektrisitet 55 år, europeisk miks"},{"$f":"SUMIF(Utslippsfaktorer!B:B,Beregninger!J173,Utslippsfaktorer!D:D)","v":0.13600000000000001},{"$f":"VLOOKUP(J173,Utslippsfaktorer!B:C,2,FALSE)","v":"kg CO2e/kWh"},0,{"$f":"SUMIF($O$125:$BV$125,\"<=\" & 'Prosjektbeskrivelse og inndata'!$C$14,O173:BL173)","v":0},"","","","","","",0,"","","","","","",0,"","","","","","",0,"","","","","","",0,"","","","","","",0,"","","","","","",0,"","","","","","",0,"","","","","","",0,"","","",""]
[null,null,null,"Kantklipp diesel",{"$f":"C167*'Drift og vedlikehold'!E24*Beregningsfaktorer!D86","v":1.1159999999999999},"liter diesel",1,"Drift","Diesel",{"$f":"Utslippsfaktorer!B20","v":"Fossil diesel (WTW)"},{"$f":"SUMIF(Utslippsfaktorer!B:B,Beregninger!J174,Utslippsfaktorer!D:D)","v":3.24},{"$f":"VLOOKUP(J174,Utslippsfaktorer!B:C,2,FALSE)","v":"kg CO2e/liter"},3.6158399999999999E-3,{"$f":"SUMIF($O$125:$BV$125,\"<=\" & 'Prosjektbeskrivelse og inndata'!$C$14,O174:BL174)","v":0.21695040000000015},3.6158399999999999E-3,3.6158399999999999E-3,3.6158399999999999E-3,3.6158399999999999E-3,3.6158399999999999E-3,3.6158399999999999E-3,3.6158399999999999E-3,3.6158399999999999E-3,3.6158399999999999E-3,3.6158399999999999E-3,3.6158399999999999E-3,3.6158399999999999E-3,3.6158399999999999E-3,3.6158399999999999E-3,3.6158399999999999E-3,3.6158399999999999E-3,3.6158399999999999E-3,3.6158399999999999E-3,3.6158399999999999E-3,3.6158399999999999E-3,3.6158399999999999E-3,3.6158399999999999E-3,3.6158399999999999E-3,3.6158399999999999E-3,3.6158399999999999E-3,3.6158399999999999E-3,3.6158399999999999E-3,3.6158399999999999E-3,3.6158399999999999E-3,3.6158399999999999E-3,3.6158399999999999E-3,3.6158399999999999E-3,3.6158399999999999E-3,3.6158399999999999E-3,3.6158399999999999E-3,3.6158399999999999E-3,3.6158399999999999E-3,3.6158399999999999E-3,3.6158399999999999E-3,3.6158399999999999E-3,3.6158399999999999E-3,3.6158399999999999E-3,3.6158399999999999E-3,3.6158399999999999E-3,3.6158399999999999E-3,3.6158399999999999E-3,3.6158399999999999E-3,3.6158399999999999E-3,3.6158399999999999E-3,3.6158399999999999E-3,3.6158399999999999E-3,3.6158399999999999E-3,3.6158399999999999E-3,3.6158399999999999E-3,3.6158399999999999E-3,3.6158399999999999E-3,3.6158399999999999E-3,3.6158399999999999E-3,3.6158399999999999E-3,3.6158399999999999E-3]
[null,null,null,"Kantklipp biodiesel",{"$f":"C167*'Drift og vedlikehold'!F24*Beregningsfaktorer!D86","v":8.4000000000000005E-2},"liter biodiesel",1,"Drift","Biodiesel",{"$f":"Utslippsfaktorer!B18","v":"Biodiesel (WTT)"},{"$f":"SUMIF(Utslippsfaktorer!B:B,Beregninger!J175,Utslippsfaktorer!D:D)","v":1.92},{"$f":"VLOOKUP(J175,Utslippsfaktorer!B:C,2,FALSE)","v":"kg CO2e/liter"},1.6128E-4,{"$f":"SUMIF($O$125:$BV$125,\"<=\" & 'Prosjektbeskrivelse og inndata'!$C$14,O175:BL175)","v":9.6767999999999941E-3},1.6128E-4,1.6128E-4,1.6128E-4,1.6128E-4,1.6128E-4,1.6128E-4,1.6128E-4,1.6128E-4,1.6128E-4,1.6128E-4,1.6128E-4,1.6128E-4,1.6128E-4,1.6128E-4,1.6128E-4,1.6128E-4,1.6128E-4,1.6128E-4,1.6128E-4,1.6128E-4,1.6128E-4,1.6128E-4,1.6128E-4,1.6128E-4,1.6128E-4,1.6128E-4,1.6128E-4,1.6128E-4,1.6128E-4,1.6128E-4,1.6128E-4,1.6128E-4,1.6128E-4,1.6128E-4,1.6128E-4,1.6128E-4,1.6128E-4,1.6128E-4,1.6128E-4,1.6128E-4,1.6128E-4,1.6128E-4,1.6128E-4,1.6128E-4,1.6128E-4,1.6128E-4,1.6128E-4,1.6128E-4,1.6128E-4,1.6128E-4,1.6128E-4,1.6128E-4,1.6128E-4,1.6128E-4,1.6128E-4,1.6128E-4,1.6128E-4,1.6128E-4,1.6128E-4,1.6128E-4]
[null,null,null,"Kantklipp elektrisk/hydrogen",{"$f":"C167*'Drift og vedlikehold'!G24*Beregningsfaktorer!D86","v":0},"kWh",1,"Drift","Elektrisitet",{"$f":"Utslippsfaktorer!B24","v":"Elektrisitet 55 år, europeisk miks"},{"$f":"SUMIF(Utslippsfaktorer!B:B,Beregninger!J176,Utslippsfaktorer!D:D)","v":0.13600000000000001},{"$f":"VLOOKUP(J176,Utslippsfaktorer!B:C,2,FALSE)","v":"kg CO2e/kWh"},0,{"$f":"SUMIF($O$125:$BV$125,\"<=\" & 'Prosjektbeskrivelse og inndata'!$C$14,O176:BL176)","v":0},{"$f":"IF(MOD(O$125,$G176)=0,$M176,\"\")","v":0},0,0,0,0,0,0,0,0,0,{"$f":"IF(MOD(Y$125,$G176)=0,$M176,\"\")","v":0},0,0,0,0,0,0,0,0,0,{"$f":"IF(MOD(AI$125,$G176)=0,$M176,\"\")","v":0},0,0,0,0,0,0,0,0,0,{"$f":"IF(MOD(AS$125,$G176)=0,$M176,\"\")","v":0},0,0,0,0,0,0,0,0,0,{"$f":"IF(MOD(BC$125,$G176)=0,$M176,\"\")","v":0},0,0,0,0,0,0,0,0,0,{"$f":"IF(MOD(BM$125,$G176)=0,$M176,\"\")","v":0},0,0,0,0,0,0,0,0,0]
[null,null,null,"Grøfterensk diesel",{"$f":"C167*'Drift og vedlikehold'!E25*Beregningsfaktorer!D86","v":74.399999999999991},"liter diesel",{"$f":"Beregningsfaktorer!D54","v":3},"Drift","Diesel",{"$f":"Utslippsfaktorer!B20","v":"Fossil diesel (WTW)"},{"$f":"SUMIF(Utslippsfaktorer!B:B,Beregninger!J177,Utslippsfaktorer!D:D)","v":3.24},{"$f":"VLOOKUP(J177,Utslippsfaktorer!B:C,2,FALSE)","v":"kg CO2e/liter"},0.24105599999999999,{"$f":"SUMIF($O$125:$BV$125,\"<=\" & 'Prosjektbeskrivelse og inndata'!$C$14,O177:BL177)","v":4.8211200000000005},"","",0.24105599999999999,"","",0.24105599999999999,"","",0.24105599999999999,"","",0.24105599999999999,"","",0.24105599999999999,"","",0.24105599999999999,"","",0.24105599999999999,"","",0.24105599999999999,"","",0.24105599999999999,"","",0.24105599999999999,"","",0.24105599999999999,"","",0.24105599999999999,"","",0.24105599999999999,"","",0.24105599999999999,"","",0.24105599999999999,"","",0.24105599999999999,"","",0.24105599999999999,"","",0.24105599999999999,"","",0.24105599999999999,"","",0.24105599999999999]
[null,null,null,"Grøfterensk biodiesel",{"$f":"C167*'Drift og vedlikehold'!F25*Beregningsfaktorer!D86","v":5.6000000000000005},"liter biodiesel",{"$f":"Beregningsfaktorer!D54","v":3},"Drift","Biodiesel",{"$f":"Utslippsfaktorer!B18","v":"Biodiesel (WTT)"},{"$f":"SUMIF(Utslippsfaktorer!B:B,Beregninger!J178,Utslippsfaktorer!D:D)","v":1.92},{"$f":"VLOOKUP(J178,Utslippsfaktorer!B:C,2,FALSE)","v":"kg CO2e/liter"},1.0752000000000001E-2,{"$f":"SUMIF($O$125:$BV$125,\"<=\" & 'Prosjektbeskrivelse og inndata'!$C$14,O178:BL178)","v":0.21504000000000009},"","",1.0752000000000001E-2,"","",1.0752000000000001E-2,"","",1.0752000000000001E-2,"","",1.0752000000000001E-2,"","",1.0752000000000001E-2,"","",1.0752000000000001E-2,"","",1.0752000000000001E-2,"","",1.0752000000000001E-2,"","",1.0752000000000001E-2,"","",1.0752000000000001E-2,"","",1.0752000000000001E-2,"","",1.0752000000000001E-2,"","",1.0752000000000001E-2,"","",1.0752000000000001E-2,"","",1.0752000000000001E-2,"","",1.0752000000000001E-2,"","",1.0752000000000001E-2,"","",1.0752000000000001E-2,"","",1.0752000000000001E-2,"","",1.0752000000000001E-2]
[null,null,null,"Grøfterensk elektrisk/hydrogen",{"$f":"C167*'Drift og vedlikehold'!G25*Beregningsfaktorer!D86","v":0},"kWh",{"$f":"Beregningsfaktorer!D54","v":3},"Drift","Elektrisitet",{"$f":"Utslippsfaktorer!B24","v":"Elektrisitet 55 år, europeisk miks"},{"$f":"SUMIF(Utslippsfaktorer!B:B,Beregninger!J179,Utslippsfaktorer!D:D)","v":0.13600000000000001},{"$f":"VLOOKUP(J179,Utslippsfaktorer!B:C,2,FALSE)","v":"kg CO2e/kWh"},0,{"$f":"SUMIF($O$125:$BV$125,\"<=\" & 'Prosjektbeskrivelse og inndata'!$C$14,O179:BL179)","v":0},"","",0,"","",0,"","",0,"","",0,"","",0,"","",0,"","",0,"","",0,"","",0,"","",0,"","",0,"","",0,"","",0,"","",0,"","",0,"","",0,"","",0,"","",0,"","",0,"","",0]
[null,null,null,"Transport jordmasser grøfterensk diesel",{"$f":"C167*'Drift og vedlikehold'!F15*Beregningsfaktorer!D86","v":19.295639999999999},"liter diesel",{"$f":"Beregningsfaktorer!D54","v":3},"Drift","Diesel",{"$f":"Utslippsfaktorer!B20","v":"Fossil diesel (WTW)"},{"$f":"SUMIF(Utslippsfaktorer!B:B,Beregninger!J180,Utslippsfaktorer!D:D)","v":3.24},{"$f":"VLOOKUP(J180,Utslippsfaktorer!B:C,2,FALSE)","v":"kg CO2e/liter"},6.2517873599999996E-2,{"$f":"SUMIF($O$125:$BV$125,\"<=\" & 'Prosjektbeskrivelse og inndata'!$C$14,O180:BL180)","v":1.2503574720000006},"","",6.2517873599999996E-2,"","",6.2517873599999996E-2,"","",6.2517873599999996E-2,"","",6.2517873599999996E-2,"","",6.2517873599999996E-2,"","",6.2517873599999996E-2,"","",6.2517873599999996E-2,"","",6.2517873599999996E-2,"","",6.2517873599999996E-2,"","",6.2517873599999996E-2,"","",6.2517873599999996E-2,"","",6.2517873599999996E-2,"","",6.2517873599999996E-2,"","",6.2517873599999996E-2,"","",6.2517873599999996E-2,"","",6.2517873599999996E-2,"","",6.2517873599999996E-2,"","",6.2517873599999996E-2,"","",6.2517873599999996E-2,"","",6.2517873599999996E-2]
[null,null,null,"Transport jordmasser grøfterensk biodiesel",{"$f":"C167*'Drift og vedlikehold'!G15*Beregningsfaktorer!D86","v":1.4523600000000001},"liter biodiesel",{"$f":"Beregningsfaktorer!D54","v":3},"Drift","Biodiesel",{"$f":"Utslippsfaktorer!B18","v":"Biodiesel (WTT)"},{"$f":"SUMIF(Utslippsfaktorer!B:B,Beregninger!J181,Utslippsfaktorer!D:D)","v":1.92},{"$f":"VLOOKUP(J181,Utslippsfaktorer!B:C,2,FALSE)","v":"kg CO2e/liter"},2.7885312E-3,{"$f":"SUMIF($O$125:$BV$125,\"<=\" & 'Prosjektbeskrivelse og inndata'!$C$14,O181:BL181)","v":5.5770623999999998E-2},"","",2.7885312E-3,"","",2.7885312E-3,"","",2.7885312E-3,"","",2.7885312E-3,"","",2.7885312E-3,"","",2.7885312E-3,"","",2.7885312E-3,"","",2.7885312E-3,"","",2.7885312E-3,"","",2.7885312E-3,"","",2.7885312E-3,"","",2.7885312E-3,"","",2.7885312E-3,"","",2.7885312E-3,"","",2.7885312E-3,"","",2.7885312E-3,"","",2.7885312E-3,"","",2.7885312E-3,"","",2.7885312E-3,"","",2.7885312E-3]
[null,null,null,"Transport jordmasser grøfterensk elektrisk/hydrogen",{"$f":"C167*'Drift og vedlikehold'!H15*Beregningsfaktorer!D86","v":0},"kWh",{"$f":"Beregningsfaktorer!D54","v":3},"Drift","Elektrisitet",{"$f":"Utslippsfaktorer!B24","v":"Elektrisitet 55 år, europeisk miks"},{"$f":"SUMIF(Utslippsfaktorer!B:B,Beregninger!J182,Utslippsfaktorer!D:D)","v":0.13600000000000001},{"$f":"VLOOKUP(J182,Utslippsfaktorer!B:C,2,FALSE)","v":"kg CO2e/kWh"},0,{"$f":"SUMIF($O$125:$BV$125,\"<=\" & 'Prosjektbeskrivelse og inndata'!$C$14,O182:BL182)","v":0},"","",0,"","",0,"","",0,"","",0,"","",0,"","",0,"","",0,"","",0,"","",0,"","",0,"","",0,"","",0,"","",0,"","",0,"","",0,"","",0,"","",0,"","",0,"","",0,"","",0]
[null,null,null,"Feiing diesel",{"$f":"C167*'Drift og vedlikehold'!E26*Beregningsfaktorer!D80","v":4.1849999999999996},"liter diesel",1,"Drift","Diesel",{"$f":"Utslippsfaktorer!B20","v":"Fossil diesel (WTW)"},{"$f":"SUMIF(Utslippsfaktorer!B:B,Beregninger!J183,Utslippsfaktorer!D:D)","v":3.24},{"$f":"VLOOKUP(J183,Utslippsfaktorer!B:C,2,FALSE)","v":"kg CO2e/liter"},1.3559400000000001E-2,{"$f":"SUMIF($O$125:$BV$125,\"<=\" & 'Prosjektbeskrivelse og inndata'!$C$14,O183:BL183)","v":0.81356400000000006},1.3559400000000001E-2,1.3559400000000001E-2,1.3559400000000001E-2,1.3559400000000001E-2,1.3559400000000001E-2,1.3559400000000001E-2,1.3559400000000001E-2,1.3559400000000001E-2,1.3559400000000001E-2,1.3559400000000001E-2,1.3559400000000001E-2,1.3559400000000001E-2,1.3559400000000001E-2,1.3559400000000001E-2,1.3559400000000001E-2,1.3559400000000001E-2,1.3559400000000001E-2,1.3559400000000001E-2,1.3559400000000001E-2,1.3559400000000001E-2,1.3559400000000001E-2,1.3559400000000001E-2,1.3559400000000001E-2,1.3559400000000001E-2,1.3559400000000001E-2,1.3559400000000001E-2,1.3559400000000001E-2,1.3559400000000001E-2,1.3559400000000001E-2,1.3559400000000001E-2,1.3559400000000001E-2,1.3559400000000001E-2,1.3559400000000001E-2,1.3559400000000001E-2,1.3559400000000001E-2,1.3559400000000001E-2,1.3559400000000001E-2,1.3559400000000001E-2,1.3559400000000001E-2,1.3559400000000001E-2,1.3559400000000001E-2,1.3559400000000001E-2,1.3559400000000001E-2,1.3559400000000001E-2,1.3559400000000001E-2,1.3559400000000001E-2,1.3559400000000001E-2,1.3559400000000001E-2,1.3559400000000001E-2,1.3559400000000001E-2,1.3559400000000001E-2,1.3559400000000001E-2,1.3559400000000001E-2,1.3559400000000001E-2,1.3559400000000001E-2,1.3559400000000001E-2,1.3559400000000001E-2,1.3559400000000001E-2,1.3559400000000001E-2,1.3559400000000001E-2]
[null,null,null,"Feiing biodiesel",{"$f":"C167*'Drift og vedlikehold'!F26*Beregningsfaktorer!D80","v":0.31500000000000006},"liter biodiesel",1,"Drift","Biodiesel",{"$f":"Utslippsfaktorer!B18","v":"Biodiesel (WTT)"},{"$f":"SUMIF(Utslippsfaktorer!B:B,Beregninger!J184,Utslippsfaktorer!D:D)","v":1.92},{"$f":"VLOOKUP(J184,Utslippsfaktorer!B:C,2,FALSE)","v":"kg CO2e/liter"},6.0480000000000006E-4,{"$f":"SUMIF($O$125:$BV$125,\"<=\" & 'Prosjektbeskrivelse og inndata'!$C$14,O184:BL184)","v":3.6288000000000008E-2},6.0480000000000006E-4,6.0480000000000006E-4,6.0480000000000006E-4,6.0480000000000006E-4,6.0480000000000006E-4,6.0480000000000006E-4,6.0480000000000006E-4,6.0480000000000006E-4,6.0480000000000006E-4,6.0480000000000006E-4,6.0480000000000006E-4,6.0480000000000006E-4,6.0480000000000006E-4,6.0480000000000006E-4,6.0480000000000006E-4,6.0480000000000006E-4,6.0480000000000006E-4,6.0480000000000006E-4,6.0480000000000006E-4,6.0480000000000006E-4,6.0480000000000006E-4,6.0480000000000006E-4,6.0480000000000006E-4,6.0480000000000006E-4,6.0480000000000006E-4,6.0480000000000006E-4,6.0480000000000006E-4,6.0480000000000006E-4,6.0480000000000006E-4,6.0480000000000006E-4,6.0480000000000006E-4,6.0480000000000006E-4,6.0480000000000006E-4,6.0480000000000006E-4,6.0480000000000006E-4,6.0480000000000006E-4,6.0480000000000006E-4,6.0480000000000006E-4,6.0480000000000006E-4,6.0480000000000006E-4,6.0480000000000006E-4,6.0480000000000006E-4,6.0480000000000006E-4,6.0480000000000006E-4,6.0480000000000006E-4,6.0480000000000006E-4,6.0480000000000006E-4,6.0480000000000006E-4,6.0480000000000006E-4,6.0480000000000006E-4,6.0480000000000006E-4,6.0480000000000006E-4,6.0480000000000006E-4,6.0480000000000006E-4,6.0480000000000006E-4,6.0480000000000006E-4,6.0480000000000006E-4,6.0480000000000006E-4,6.0480000000000006E-4,6.0480000000000006E-4]
[null,null,null,"Feiing elektrisk/hydrogen",{"$f":"C167*'Drift og vedlikehold'!G26*Beregningsfaktorer!D80","v":0},"kWh",1,"Drift","Elektrisitet",{"$f":"Utslippsfaktorer!B24","v":"Elektrisitet 55 år, europeisk miks"},{"$f":"SUMIF(Utslippsfaktorer!B:B,Beregninger!J185,Utslippsfaktorer!D:D)","v":0.13600000000000001},{"$f":"VLOOKUP(J185,Utslippsfaktorer!B:C,2,FALSE)","v":"kg CO2e/kWh"},0,{"$f":"SUMIF($O$125:$BV$125,\"<=\" & 'Prosjektbeskrivelse og inndata'!$C$14,O185:BL185)","v":0},0,0,0,0,0,0,0,0,0,0,0,0,0,0,0,0,0,0,0,0,0,0,0,0,0,0,0,0,0,0,0,0,0,0,0,0,0,0,0,0,0,0,0,0,0,0,0,0,0,0,0,0,0,0,0,0,0,0,0,0]
[null,null,null,"Salting diesel",{"$f":"C167*'Drift og vedlikehold'!E27*(Beregningsfaktorer!D80/2)","v":35.711999999999996},"liter diesel",1,"Drift","Diesel",{"$f":"Utslippsfaktorer!B20","v":"Fossil diesel (WTW)"},{"$f":"SUMIF(Utslippsfaktorer!B:B,Beregninger!J186,Utslippsfaktorer!D:D)","v":3.24},{"$f":"VLOOKUP(J186,Utslippsfaktorer!B:C,2,FALSE)","v":"kg CO2e/liter"},0.11570688,{"$f":"SUMIF($O$125:$BV$125,\"<=\" & 'Prosjektbeskrivelse og inndata'!$C$14,O186:BL186)","v":6.9424128000000049},{"$f":"IF(MOD(O$125,$G186)=0,$M186,\"\")","v":0.11570688},0.11570688,0.11570688,0.11570688,0.11570688,0.11570688,0.11570688,0.11570688,0.11570688,0.11570688,{"$f":"IF(MOD(Y$125,$G186)=0,$M186,\"\")","v":0.11570688},0.11570688,0.11570688,0.11570688,0.11570688,0.11570688,0.11570688,0.11570688,0.11570688,0.11570688,{"$f":"IF(MOD(AI$125,$G186)=0,$M186,\"\")","v":0.11570688},0.11570688,0.11570688,0.11570688,0.11570688,0.11570688,0.11570688,0.11570688,0.11570688,0.11570688,{"$f":"IF(MOD(AS$125,$G186)=0,$M186,\"\")","v":0.11570688},0.11570688,0.11570688,0.11570688,0.11570688,0.11570688,0.11570688,0.11570688,0.11570688,0.11570688,{"$f":"IF(MOD(BC$125,$G186)=0,$M186,\"\")","v":0.11570688},0.11570688,0.11570688,0.11570688,0.11570688,0.11570688,0.11570688,0.11570688,0.11570688,0.11570688,{"$f":"IF(MOD(BM$125,$G186)=0,$M186,\"\")","v":0.11570688},0.11570688,0.11570688,0.11570688,0.11570688,0.11570688,0.11570688,0.11570688,0.11570688,0.11570688]
[null,null,null,"Salting biodiesel",{"$f":"C167*'Drift og vedlikehold'!F27*(Beregningsfaktorer!D80/2)","v":2.6880000000000002},"liter biodiesel",1,"Drift","Biodiesel",{"$f":"Utslippsfaktorer!B18","v":"Biodiesel (WTT)"},{"$f":"SUMIF(Utslippsfaktorer!B:B,Beregninger!J187,Utslippsfaktorer!D:D)","v":1.92},{"$f":"VLOOKUP(J187,Utslippsfaktorer!B:C,2,FALSE)","v":"kg CO2e/liter"},5.16096E-3,{"$f":"SUMIF($O$125:$BV$125,\"<=\" & 'Prosjektbeskrivelse og inndata'!$C$14,O187:BL187)","v":0.30965759999999981},5.16096E-3,5.16096E-3,5.16096E-3,5.16096E-3,5.16096E-3,5.16096E-3,5.16096E-3,5.16096E-3,5.16096E-3,5.16096E-3,5.16096E-3,5.16096E-3,5.16096E-3,5.16096E-3,5.16096E-3,5.16096E-3,5.16096E-3,5.16096E-3,5.16096E-3,5.16096E-3,5.16096E-3,5.16096E-3,5.16096E-3,5.16096E-3,5.16096E-3,5.16096E-3,5.16096E-3,5.16096E-3,5.16096E-3,5.16096E-3,5.16096E-3,5.16096E-3,5.16096E-3,5.16096E-3,5.16096E-3,5.16096E-3,5.16096E-3,5.16096E-3,5.16096E-3,5.16096E-3,5.16096E-3,5.16096E-3,5.16096E-3,5.16096E-3,5.16096E-3,5.16096E-3,5.16096E-3,5.16096E-3,5.16096E-3,5.16096E-3,5.16096E-3,5.16096E-3,5.16096E-3,5.16096E-3,5.16096E-3,5.16096E-3,5.16096E-3,5.16096E-3,5.16096E-3,5.16096E-3]
[null,null,null,"Salting elektrisk/hydrogen",{"$f":"C167*'Drift og vedlikehold'!G27*(Beregningsfaktorer!D80/2)","v":0},"kWh",1,"Drift","Elektrisitet",{"$f":"Utslippsfaktorer!B24","v":"Elektrisitet 55 år, europeisk miks"},{"$f":"SUMIF(Utslippsfaktorer!B:B,Beregninger!J188,Utslippsfaktorer!D:D)","v":0.13600000000000001},{"$f":"VLOOKUP(J188,Utslippsfaktorer!B:C,2,FALSE)","v":"kg CO2e/kWh"},0,{"$f":"SUMIF($O$125:$BV$125,\"<=\" & 'Prosjektbeskrivelse og inndata'!$C$14,O188:BL188)","v":0},0,0,0,0,0,0,0,0,0,0,0,0,0,0,0,0,0,0,0,0,0,0,0,0,0,0,0,0,0,0,0,0,0,0,0,0,0,0,0,0,0,0,0,0,0,0,0,0,0,0,0,0,0,0,0,0,0,0,0,0]
[null,null,null,"Salt",{"$f":"C167*'Drift og vedlikehold'!E16","v":6300},"kg salt",1,"Drift","Salt",{"$f":"Utslippsfaktorer!B12","v":"Salt"},{"$f":"SUMIF(Utslippsfaktorer!B:B,Beregninger!J189,Utslippsfaktorer!D:D)","v":0.17899999999999999},{"$f":"VLOOKUP(J189,Utslippsfaktorer!B:C,2,FALSE)","v":"kg CO2e/kg"},1.1277000000000001,{"$f":"SUMIF($O$125:$BV$125,\"<=\" & 'Prosjektbeskrivelse og inndata'!$C$14,O189:BL189)","v":67.661999999999949},1.1277000000000001,1.1277000000000001,1.1277000000000001,1.1277000000000001,1.1277000000000001,1.1277000000000001,1.1277000000000001,1.1277000000000001,1.1277000000000001,1.1277000000000001,1.1277000000000001,1.1277000000000001,1.1277000000000001,1.1277000000000001,1.1277000000000001,1.1277000000000001,1.1277000000000001,1.1277000000000001,1.1277000000000001,1.1277000000000001,1.1277000000000001,1.1277000000000001,1.1277000000000001,1.1277000000000001,1.1277000000000001,1.1277000000000001,1.1277000000000001,1.1277000000000001,1.1277000000000001,1.1277000000000001,1.1277000000000001,1.1277000000000001,1.1277000000000001,1.1277000000000001,1.1277000000000001,1.1277000000000001,1.1277000000000001,1.1277000000000001,1.1277000000000001,1.1277000000000001,1.1277000000000001,1.1277000000000001,1.1277000000000001,1.1277000000000001,1.1277000000000001,1.1277000000000001,1.1277000000000001,1.1277000000000001,1.1277000000000001,1.1277000000000001,1.1277000000000001,1.1277000000000001,1.1277000000000001,1.1277000000000001,1.1277000000000001,1.1277000000000001,1.1277000000000001,1.1277000000000001,1.1277000000000001,1.1277000000000001]
[null,null,null,"Salttransport diesel",{"$f":"C167*'Drift og vedlikehold'!F16","v":58.589999999999989},"liter diesel",1,"Drift","Diesel",{"$f":"Utslippsfaktorer!B20","v":"Fossil diesel (WTW)"},{"$f":"SUMIF(Utslippsfaktorer!B:B,Beregninger!J190,Utslippsfaktorer!D:D)","v":3.24},{"$f":"VLOOKUP(J190,Utslippsfaktorer!B:C,2,FALSE)","v":"kg CO2e/liter"},0.18983159999999999,{"$f":"SUMIF($O$125:$BV$125,\"<=\" & 'Prosjektbeskrivelse og inndata'!$C$14,O190:BL190)","v":11.38989599999999},0.18983159999999999,0.18983159999999999,0.18983159999999999,0.18983159999999999,0.18983159999999999,0.18983159999999999,0.18983159999999999,0.18983159999999999,0.18983159999999999,0.18983159999999999,0.18983159999999999,0.18983159999999999,0.18983159999999999,0.18983159999999999,0.18983159999999999,0.18983159999999999,0.18983159999999999,0.18983159999999999,0.18983159999999999,0.18983159999999999,0.18983159999999999,0.18983159999999999,0.18983159999999999,0.18983159999999999,0.18983159999999999,0.18983159999999999,0.18983159999999999,0.18983159999999999,0.18983159999999999,0.18983159999999999,0.18983159999999999,0.18983159999999999,0.18983159999999999,0.18983159999999999,0.18983159999999999,0.18983159999999999,0.18983159999999999,0.18983159999999999,0.18983159999999999,0.18983159999999999,0.18983159999999999,0.18983159999999999,0.18983159999999999,0.18983159999999999,0.18983159999999999,0.18983159999999999,0.18983159999999999,0.18983159999999999,0.18983159999999999,0.18983159999999999,0.18983159999999999,0.18983159999999999,0.18983159999999999,0.18983159999999999,0.18983159999999999,0.18983159999999999,0.18983159999999999,0.18983159999999999,0.18983159999999999,0.18983159999999999]
[null,null,null,"Salttransport biodiesel",{"$f":"C167*'Drift og vedlikehold'!G16","v":4.41},"liter biodiesel",1,"Drift","Biodiesel",{"$f":"Utslippsfaktorer!B18","v":"Biodiesel (WTT)"},{"$f":"SUMIF(Utslippsfaktorer!B:B,Beregninger!J191,Utslippsfaktorer!D:D)","v":1.92},{"$f":"VLOOKUP(J191,Utslippsfaktorer!B:C,2,FALSE)","v":"kg CO2e/liter"},8.4671999999999994E-3,{"$f":"SUMIF($O$125:$BV$125,\"<=\" & 'Prosjektbeskrivelse og inndata'!$C$14,O191:BL191)","v":0.50803200000000026},8.4671999999999994E-3,8.4671999999999994E-3,8.4671999999999994E-3,8.4671999999999994E-3,8.4671999999999994E-3,8.4671999999999994E-3,8.4671999999999994E-3,8.4671999999999994E-3,8.4671999999999994E-3,8.4671999999999994E-3,8.4671999999999994E-3,8.4671999999999994E-3,8.4671999999999994E-3,8.4671999999999994E-3,8.4671999999999994E-3,8.4671999999999994E-3,8.4671999999999994E-3,8.4671999999999994E-3,8.4671999999999994E-3,8.4671999999999994E-3,8.4671999999999994E-3,8.4671999999999994E-3,8.4671999999999994E-3,8.4671999999999994E-3,8.4671999999999994E-3,8.4671999999999994E-3,8.4671999999999994E-3,8.4671999999999994E-3,8.4671999999999994E-3,8.4671999999999994E-3,8.4671999999999994E-3,8.4671999999999994E-3,8.4671999999999994E-3,8.4671999999999994E-3,8.4671999999999994E-3,8.4671999999999994E-3,8.4671999999999994E-3,8.4671999999999994E-3,8.4671999999999994E-3,8.4671999999999994E-3,8.4671999999999994E-3,8.4671999999999994E-3,8.4671999999999994E-3,8.4671999999999994E-3,8.4671999999999994E-3,8.4671999999999994E-3,8.4671999999999994E-3,8.4671999999999994E-3,8.4671999999999994E-3,8.4671999999999994E-3,8.4671999999999994E-3,8.4671999999999994E-3,8.4671999999999994E-3,8.4671999999999994E-3,8.4671999999999994E-3,8.4671999999999994E-3,8.4671999999999994E-3,8.4671999999999994E-3,8.4671999999999994E-3,8.4671999999999994E-3]
[null,null,null,"Salttransport elektrisk/hydrogen",{"$f":"C167*'Drift og vedlikehold'!H16","v":0},"kWh",1,"Drift","Elektrisitet",{"$f":"Utslippsfaktorer!B24","v":"Elektrisitet 55 år, europeisk miks"},{"$f":"SUMIF(Utslippsfaktorer!B:B,Beregninger!J192,Utslippsfaktorer!D:D)","v":0.13600000000000001},{"$f":"VLOOKUP(J192,Utslippsfaktorer!B:C,2,FALSE)","v":"kg CO2e/kWh"},0,{"$f":"SUMIF($O$125:$BV$125,\"<=\" & 'Prosjektbeskrivelse og inndata'!$C$14,O192:BL192)","v":0},0,0,0,0,0,0,0,0,0,0,0,0,0,0,0,0,0,0,0,0,0,0,0,0,0,0,0,0,0,0,0,0,0,0,0,0,0,0,0,0,0,0,0,0,0,0,0,0,0,0,0,0,0,0,0,0,0,0,0,0]
[null,null,null,"Brøyting diesel",{"$f":"C167*'Drift og vedlikehold'!E28","v":258.80486400000001},"liter diesel",1,"Drift","Diesel",{"$f":"Utslippsfaktorer!B20","v":"Fossil diesel (WTW)"},{"$f":"SUMIF(Utslippsfaktorer!B:B,Beregninger!J193,Utslippsfaktorer!D:D)","v":3.24},{"$f":"VLOOKUP(J193,Utslippsfaktorer!B:C,2,FALSE)","v":"kg CO2e/liter"},0.83852775936000012,{"$f":"SUMIF($O$125:$BV$125,\"<=\" & 'Prosjektbeskrivelse og inndata'!$C$14,O193:BL193)","v":50.311665561599987},0.83852775936000012,0.83852775936000012,0.83852775936000012,0.83852775936000012,0.83852775936000012,0.83852775936000012,0.83852775936000012,0.83852775936000012,0.83852775936000012,0.83852775936000012,0.83852775936000012,0.83852775936000012,0.83852775936000012,0.83852775936000012,0.83852775936000012,0.83852775936000012,0.83852775936000012,0.83852775936000012,0.83852775936000012,0.83852775936000012,0.83852775936000012,0.83852775936000012,0.83852775936000012,0.83852775936000012,0.83852775936000012,0.83852775936000012,0.83852775936000012,0.83852775936000012,0.83852775936000012,0.83852775936000012,0.83852775936000012,0.83852775936000012,0.83852775936000012,0.83852775936000012,0.83852775936000012,0.83852775936000012,0.83852775936000012,0.83852775936000012,0.83852775936000012,0.83852775936000012,0.83852775936000012,0.83852775936000012,0.83852775936000012,0.83852775936000012,0.83852775936000012,0.83852775936000012,0.83852775936000012,0.83852775936000012,0.83852775936000012,0.83852775936000012,0.83852775936000012,0.83852775936000012,0.83852775936000012,0.83852775936000012,0.83852775936000012,0.83852775936000012,0.83852775936000012,0.83852775936000012,0.83852775936000012,0.83852775936000012]
[null,null,null,"Brøyting biodiesel",{"$f":"C167*'Drift og vedlikehold'!F28","v":19.479936000000002},"liter biodiesel",1,"Drift","Biodiesel",{"$f":"Utslippsfaktorer!B18","v":"Biodiesel (WTT)"},{"$f":"SUMIF(Utslippsfaktorer!B:B,Beregninger!J194,Utslippsfaktorer!D:D)","v":1.92},{"$f":"VLOOKUP(J194,Utslippsfaktorer!B:C,2,FALSE)","v":"kg CO2e/liter"},3.7401477120000005E-2,{"$f":"SUMIF($O$125:$BV$125,\"<=\" & 'Prosjektbeskrivelse og inndata'!$C$14,O194:BL194)","v":2.2440886271999991},3.7401477120000005E-2,3.7401477120000005E-2,3.7401477120000005E-2,3.7401477120000005E-2,3.7401477120000005E-2,3.7401477120000005E-2,3.7401477120000005E-2,3.7401477120000005E-2,3.7401477120000005E-2,3.7401477120000005E-2,3.7401477120000005E-2,3.7401477120000005E-2,3.7401477120000005E-2,3.7401477120000005E-2,3.7401477120000005E-2,3.7401477120000005E-2,3.7401477120000005E-2,3.7401477120000005E-2,3.7401477120000005E-2,3.7401477120000005E-2,3.7401477120000005E-2,3.7401477120000005E-2,3.7401477120000005E-2,3.7401477120000005E-2,3.7401477120000005E-2,3.7401477120000005E-2,3.7401477120000005E-2,3.7401477120000005E-2,3.7401477120000005E-2,3.7401477120000005E-2,3.7401477120000005E-2,3.7401477120000005E-2,3.7401477120000005E-2,3.7401477120000005E-2,3.7401477120000005E-2,3.7401477120000005E-2,3.7401477120000005E-2,3.7401477120000005E-2,3.7401477120000005E-2,3.7401477120000005E-2,3.7401477120000005E-2,3.7401477120000005E-2,3.7401477120000005E-2,3.7401477120000005E-2,3.7401477120000005E-2,3.7401477120000005E-2,3.7401477120000005E-2,3.7401477120000005E-2,3.7401477120000005E-2,3.7401477120000005E-2,3.7401477120000005E-2,3.7401477120000005E-2,3.7401477120000005E-2,3.7401477120000005E-2,3.7401477120000005E-2,3.7401477120000005E-2,3.7401477120000005E-2,3.7401477120000005E-2,3.7401477120000005E-2,3.7401477120000005E-2]
[null,null,null,"Brøyting elektrisk/hydrogen",{"$f":"C167*'Drift og vedlikehold'!G28","v":0},"kWh",1,"Drift","Elektrisitet",{"$f":"Utslippsfaktorer!B24","v":"Elektrisitet 55 år, europeisk miks"},{"$f":"SUMIF(Utslippsfaktorer!B:B,Beregninger!J195,Utslippsfaktorer!D:D)","v":0.13600000000000001},{"$f":"VLOOKUP(J195,Utslippsfaktorer!B:C,2,FALSE)","v":"kg CO2e/kWh"},0,{"$f":"SUMIF($O$125:$BV$125,\"<=\" & 'Prosjektbeskrivelse og inndata'!$C$14,O195:BL195)","v":0},0,0,0,0,0,0,0,0,0,0,0,0,0,0,0,0,0,0,0,0,0,0,0,0,0,0,0,0,0,0,0,0,0,0,0,0,0,0,0,0,0,0,0,0,0,0,0,0,0,0,0,0,0,0,0,0,0,0,0,0]
[null,null,null,"Autovern",{"$f":"C167*'Tillegg vei'!D7*Beregningsfaktorer!D84","v":19800},"kg stål",{"$f":"Beregningsfaktorer!D51","v":30},"Vedlikehold","Stål",{"$f":"Utslippsfaktorer!B14","v":"Stål"},{"$f":"SUMIF(Utslippsfaktorer!B:B,Beregninger!J196,Utslippsfaktorer!D:D)","v":2.1234999999999999},{"$f":"VLOOKUP(J196,Utslippsfaktorer!B:C,2,FALSE)","v":"kg CO2e/kg"},42.045299999999997,{"$f":"SUMIF($O$125:$BV$125,\"<=\" & 'Prosjektbeskrivelse og inndata'!$C$14,O196:BL196)","v":84.090599999999995},{"$f":"IF(MOD(O$125,$G196)=0,$M196,\"\")","v":""},"","","","","","","","","",{"$f":"IF(MOD(Y$125,$G196)=0,$M196,\"\")","v":""},"","","","","","","","","",{"$f":"IF(MOD(AI$125,$G196)=0,$M196,\"\")","v":""},"","","","","","","","",42.045299999999997,{"$f":"IF(MOD(AS$125,$G196)=0,$M196,\"\")","v":""},"","","","","","","","","",{"$f":"IF(MOD(BC$125,$G196)=0,$M196,\"\")","v":""},"","","","","","","","","",{"$f":"IF(MOD(BM$125,$G196)=0,$M196,\"\")","v":""},"","","","","","","","",42.045299999999997]
[null,null,null,"Utskiftning autovern diesel",{"$f":"C167*'Tillegg vei'!E7*Beregningsfaktorer!D84","v":147.31199999999998},"liter diesel",{"$f":"Beregningsfaktorer!D51","v":30},"Vedlikehold","Diesel",{"$f":"Utslippsfaktorer!B20","v":"Fossil diesel (WTW)"},{"$f":"SUMIF(Utslippsfaktorer!B:B,Beregninger!J197,Utslippsfaktorer!D:D)","v":3.24},{"$f":"VLOOKUP(J197,Utslippsfaktorer!B:C,2,FALSE)","v":"kg CO2e/liter"},{"$f":"(E197*K197)/1000","v":0.47729087999999997},{"$f":"SUMIF($O$125:$BV$125,\"<=\" & 'Prosjektbeskrivelse og inndata'!$C$14,O197:BL197)","v":0.95458175999999995},"","","","","","","","","","","","","","","","","","","","","","","","","","","","","",0.47729087999999997,"","","","","","","","","","","","","","","","","","","","","","","","","","","","","",0.47729087999999997]
[null,null,null,"Utskiftning autovern biodiesel",{"$f":"C167*'Tillegg vei'!F7*Beregningsfaktorer!D84","v":11.088000000000003},"liter biodiesel",{"$f":"Beregningsfaktorer!D51","v":30},"Vedlikehold","Biodiesel",{"$f":"Utslippsfaktorer!B18","v":"Biodiesel (WTT)"},{"$f":"SUMIF(Utslippsfaktorer!B:B,Beregninger!J198,Utslippsfaktorer!D:D)","v":1.92},{"$f":"VLOOKUP(J198,Utslippsfaktorer!B:C,2,FALSE)","v":"kg CO2e/liter"},2.1288960000000003E-2,{"$f":"SUMIF($O$125:$BV$125,\"<=\" & 'Prosjektbeskrivelse og inndata'!$C$14,O198:BL198)","v":4.2577920000000005E-2},"","","","","","","","","","","","","","","","","","","","","","","","","","","","","",2.1288960000000003E-2,"","","","","","","","","","","","","","","","","","","","","","","","","","","","","",2.1288960000000003E-2]
[null,null,null,"Utskiftning autovern elektrisk/hydrogen",{"$f":"C167*'Tillegg vei'!G7*Beregningsfaktorer!D84","v":0},"kWh",{"$f":"Beregningsfaktorer!D51","v":30},"Vedlikehold","Elektrisitet",{"$f":"Utslippsfaktorer!B24","v":"Elektrisitet 55 år, europeisk miks"},{"$f":"SUMIF(Utslippsfaktorer!B:B,Beregninger!J199,Utslippsfaktorer!D:D)","v":0.13600000000000001},{"$f":"VLOOKUP(J199,Utslippsfaktorer!B:C,2,FALSE)","v":"kg CO2e/kWh"},0,{"$f":"SUMIF($O$125:$BV$125,\"<=\" & 'Prosjektbeskrivelse og inndata'!$C$14,O199:BL199)","v":0},"","","","","","","","","","","","","","","","","","","","","","","","","","","","","",0,"","","","","","","","","","","","","","","","","","","","","","","","","","","","","",0]
[null,null,null,"Transport av autovern diesel",{"$f":"C167*'Drift og vedlikehold'!F19*Beregningsfaktorer!D84","v":147.31199999999998},"liter diesel",{"$f":"Beregningsfaktorer!D51","v":30},"Vedlikehold","Diesel",{"$f":"Utslippsfaktorer!B20","v":"Fossil diesel (WTW)"},{"$f":"SUMIF(Utslippsfaktorer!B:B,Beregninger!J200,Utslippsfaktorer!D:D)","v":3.24},{"$f":"VLOOKUP(J200,Utslippsfaktorer!B:C,2,FALSE)","v":"kg CO2e/liter"},0.47729087999999997,{"$f":"SUMIF($O$125:$BV$125,\"<=\" & 'Prosjektbeskrivelse og inndata'!$C$14,O200:BL200)","v":0.95458175999999995},"","","","","","","","","","","","","","","","","","","","","","","","","","","","","",0.47729087999999997,"","","","","","","","","","","","","","","","","","","","","","","","","","","","","",0.47729087999999997]
[null,null,null,"Transport av autovern biodiesel",{"$f":"C167*'Drift og vedlikehold'!G19*Beregningsfaktorer!D84","v":11.088000000000003},"liter biodiesel",{"$f":"Beregningsfaktorer!D51","v":30},"Vedlikehold","Biodiesel",{"$f":"Utslippsfaktorer!B18","v":"Biodiesel (WTT)"},{"$f":"SUMIF(Utslippsfaktorer!B:B,Beregninger!J201,Utslippsfaktorer!D:D)","v":1.92},{"$f":"VLOOKUP(J201,Utslippsfaktorer!B:C,2,FALSE)","v":"kg CO2e/liter"},2.1288960000000003E-2,{"$f":"SUMIF($O$125:$BV$125,\"<=\" & 'Prosjektbeskrivelse og inndata'!$C$14,O201:BL201)","v":4.2577920000000005E-2},"","","","","","","","","","","","","","","","","","","","","","","","","","","","","",2.1288960000000003E-2,"","","","","","","","","","","","","","","","","","","","","","","","","","","","","",2.1288960000000003E-2]
[null,null,null,"Transport av autovern elektrisk/hydrogen",{"$f":"C167*'Drift og vedlikehold'!H19*Beregningsfaktorer!D84","v":0},"kWh",{"$f":"Beregningsfaktorer!D51","v":30},"Vedlikehold","Elektrisitet",{"$f":"Utslippsfaktorer!B24","v":"Elektrisitet 55 år, europeisk miks"},{"$f":"SUMIF(Utslippsfaktorer!B:B,Beregninger!J202,Utslippsfaktorer!D:D)","v":0.13600000000000001},{"$f":"VLOOKUP(J202,Utslippsfaktorer!B:C,2,FALSE)","v":"kg CO2e/kWh"},0,{"$f":"SUMIF($O$125:$BV$125,\"<=\" & 'Prosjektbeskrivelse og inndata'!$C$14,O202:BL202)","v":0},"","","","","","","","","","","","","","","","","","","","","","","","","","","","","",0,"","","","","","","","","","","","","","","","","","","","","","","","","","","","","",0]
[null,null,null,"Lyktestolper",{"$f":"C167*'Tillegg vei'!D6*Beregningsfaktorer!D82","v":2894.2500000000005},"kg stål",{"$f":"Beregningsfaktorer!D52","v":30},"Vedlikehold","Stål",{"$f":"Utslippsfaktorer!B14","v":"Stål"},{"$f":"SUMIF(Utslippsfaktorer!B:B,Beregninger!J203,Utslippsfaktorer!D:D)","v":2.1234999999999999},{"$f":"VLOOKUP(J203,Utslippsfaktorer!B:C,2,FALSE)","v":"kg CO2e/kg"},6.1459398750000007,{"$f":"SUMIF($O$125:$BV$125,\"<=\" & 'Prosjektbeskrivelse og inndata'!$C$14,O203:BL203)","v":12.291879750000001},"","","","","","","","","","","","","","","","","","","","","","","","","","","","","",6.1459398750000007,"","","","","","","","","","","","","","","","","","","","","","","","","","","","","",6.1459398750000007]
[null,null,null,"Transport av lyktestolper diesel",{"$f":"C167*'Drift og vedlikehold'!F18*Beregningsfaktorer!D82","v":21.53322},"liter diesel",{"$f":"Beregningsfaktorer!D52","v":30},"Vedlikehold","Diesel",{"$f":"Utslippsfaktorer!B20","v":"Fossil diesel (WTW)"},{"$f":"SUMIF(Utslippsfaktorer!B:B,Beregninger!J204,Utslippsfaktorer!D:D)","v":3.24},{"$f":"VLOOKUP(J204,Utslippsfaktorer!B:C,2,FALSE)","v":"kg CO2e/liter"},6.9767632800000007E-2,{"$f":"SUMIF($O$125:$BV$125,\"<=\" & 'Prosjektbeskrivelse og inndata'!$C$14,O204:BL204)","v":0.13953526560000001},"","","","","","","","","","","","","","","","","","","","","","","","","","","","","",6.9767632800000007E-2,"","","","","","","","","","","","","","","","","","","","","","","","","","","","","",6.9767632800000007E-2]
[null,null,null,"Transport av lyktestolper biodiesel",{"$f":"C167*'Drift og vedlikehold'!G18*Beregningsfaktorer!D82","v":1.6207800000000003},"liter biodiesel",{"$f":"Beregningsfaktorer!D52","v":30},"Vedlikehold","Biodiesel",{"$f":"Utslippsfaktorer!B18","v":"Biodiesel (WTT)"},{"$f":"SUMIF(Utslippsfaktorer!B:B,Beregninger!J205,Utslippsfaktorer!D:D)","v":1.92},{"$f":"VLOOKUP(J205,Utslippsfaktorer!B:C,2,FALSE)","v":"kg CO2e/liter"},3.1118976000000008E-3,{"$f":"SUMIF($O$125:$BV$125,\"<=\" & 'Prosjektbeskrivelse og inndata'!$C$14,O205:BL205)","v":6.2237952000000017E-3},"","","","","","","","","","","","","","","","","","","","","","","","","","","","","",3.1118976000000008E-3,"","","","","","","","","","","","","","","","","","","","","","","","","","","","","",3.1118976000000008E-3]
[null,null,null,"Transport av lyktestolper elektrisk/hydrogen",{"$f":"C167*'Drift og vedlikehold'!H18*Beregningsfaktorer!D82","v":0},"kWh",{"$f":"Beregningsfaktorer!D52","v":30},"Vedlikehold","Elektrisitet",{"$f":"Utslippsfaktorer!B24","v":"Elektrisitet 55 år, europeisk miks"},{"$f":"SUMIF(Utslippsfaktorer!B:B,Beregninger!J206,Utslippsfaktorer!D:D)","v":0.13600000000000001},{"$f":"VLOOKUP(J206,Utslippsfaktorer!B:C,2,FALSE)","v":"kg CO2e/kWh"},0,{"$f":"SUMIF($O$125:$BV$125,\"<=\" & 'Prosjektbeskrivelse og inndata'!$C$14,O206:BL206)","v":0},{"$f":"IF(MOD(O$125,$G206)=0,$M206,\"\")","v":""},"","","","","","","","","",{"$f":"IF(MOD(Y$125,$G206)=0,$M206,\"\")","v":""},"","","","","","","","","",{"$f":"IF(MOD(AI$125,$G206)=0,$M206,\"\")","v":""},"","","","","","","","",0,{"$f":"IF(MOD(AS$125,$G206)=0,$M206,\"\")","v":""},"","","","","","","","","",{"$f":"IF(MOD(BC$125,$G206)=0,$M206,\"\")","v":""},"","","","","","","","","",{"$f":"IF(MOD(BM$125,$G206)=0,$M206,\"\")","v":""},"","","","","","","","",0]
[null,null,null,"Belysning vei i dagen",{"$f":"C167*'Drift og vedlikehold'!H9*Beregningsfaktorer!D82","v":20400},"kWh",1,"Drift","Elektrisitet",{"$f":"Utslippsfaktorer!B24","v":"Elektrisitet 55 år, europeisk miks"},{"$f":"SUMIF(Utslippsfaktorer!B:B,Beregninger!J207,Utslippsfaktorer!D:D)","v":0.13600000000000001},{"$f":"VLOOKUP(J207,Utslippsfaktorer!B:C,2,FALSE)","v":"kg CO2e/kWh"},2.7744,{"$f":"SUMIF($O$125:$BV$125,\"<=\" & 'Prosjektbeskrivelse og inndata'!$C$14,O207:BL207)","v":166.46400000000017},2.7744,2.7744,2.7744,2.7744,2.7744,2.7744,2.7744,2.7744,2.7744,2.7744,2.7744,2.7744,2.7744,2.7744,2.7744,2.7744,2.7744,2.7744,2.7744,2.7744,2.7744,2.7744,2.7744,2.7744,2.7744,2.7744,2.7744,2.7744,2.7744,2.7744,2.7744,2.7744,2.7744,2.7744,2.7744,2.7744,2.7744,2.7744,2.7744,2.7744,2.7744,2.7744,2.7744,2.7744,2.7744,2.7744,2.7744,2.7744,2.7744,2.7744,2.7744,2.7744,2.7744,2.7744,2.7744,2.7744,2.7744,2.7744,2.7744,2.7744]
[null,"Drift betongbru (m)",{"$f":"SUMIF('Prosjektbeskrivelse og inndata'!$M:$M,B61,'Prosjektbeskrivelse og inndata'!$L:$L)","v":44.4},"Asfalt til reasfaltering",{"$f":"C208*'Prosjektbeskrivelse og inndata'!C12*Reasfaltering!D8","v":25474.5},"kg skjelettasfalt",{"$f":"Beregningsfaktorer!D50","v":7},"Reasfaltering","Asfalt",{"$f":"Utslippsfaktorer!B7","v":"Skjelettasfalt (Ska)"},{"$f":"SUMIF(Utslippsfaktorer!B:B,Beregninger!J208,Utslippsfaktorer!D:D)","v":6.5699999999999995E-2},{"$f":"VLOOKUP(J208,Utslippsfaktorer!B:C,2,FALSE)","v":"kg CO2e/kg"},1.6736746499999999,{"$f":"SUMIF($O$125:$BV$125,\"<=\" & 'Prosjektbeskrivelse og inndata'!$C$14,O208:BL208)","v":13.389397200000001},"","","","","","",1.6736746499999999,"","","","","","",1.6736746499999999,"","","","","","",1.6736746499999999,"","","","","","",1.6736746499999999,"","","","","","",1.6736746499999999,"","","","","","",1.6736746499999999,"","","","","","",1.6736746499999999,"","","","","","",1.6736746499999999,"","","",""]
[null,null,null,"Transport av asfalt diesel",{"$f":"C208*'Prosjektbeskrivelse og inndata'!C12*Reasfaltering!E8","v":7.1073854999999995},"liter diesel",{"$f":"Beregningsfaktorer!D50","v":7},"Reasfaltering","Diesel",{"$f":"Utslippsfaktorer!B20","v":"Fossil diesel (WTW)"},{"$f":"SUMIF(Utslippsfaktorer!B:B,Beregninger!J209,Utslippsfaktorer!D:D)","v":3.24},{"$f":"VLOOKUP(J209,Utslippsfaktorer!B:C,2,FALSE)","v":"kg CO2e/liter"},2.3027929019999997E-2,{"$f":"SUMIF($O$125:$BV$125,\"<=\" & 'Prosjektbeskrivelse og inndata'!$C$14,O209:BL209)","v":0.18422343216000001},"","","","","","",2.3027929019999997E-2,"","","","","","",2.3027929019999997E-2,"","","","","","",2.3027929019999997E-2,"","","","","","",2.3027929019999997E-2,"","","","","","",2.3027929019999997E-2,"","","","","","",2.3027929019999997E-2,"","","","","","",2.3027929019999997E-2,"","","","","","",2.3027929019999997E-2,"","","",""]
[null,null,null,"Transport av asfalt biodiesel",{"$f":"C208*'Prosjektbeskrivelse og inndata'!C12*Reasfaltering!F8","v":0.53496450000000006},"liter biodiesel",{"$f":"Beregningsfaktorer!D50","v":7},"Reasfaltering","Biodiesel",{"$f":"Utslippsfaktorer!B18","v":"Biodiesel (WTT)"},{"$f":"SUMIF(Utslippsfaktorer!B:B,Beregninger!J210,Utslippsfaktorer!D:D)","v":1.92},{"$f":"VLOOKUP(J210,Utslippsfaktorer!B:C,2,FALSE)","v":"kg CO2e/liter"},1.02713184E-3,{"$f":"SUMIF($O$125:$BV$125,\"<=\" & 'Prosjektbeskrivelse og inndata'!$C$14,O210:BL210)","v":8.2170547200000003E-3},"","","","","","",1.02713184E-3,"","","","","","",1.02713184E-3,"","","","","","",1.02713184E-3,"","","","","","",1.02713184E-3,"","","","","","",1.02713184E-3,"","","","","","",1.02713184E-3,"","","","","","",1.02713184E-3,"","","","","","",1.02713184E-3,"","","",""]
[null,null,null,"Transport av asfalt elektrisk/hydrogen",{"$f":"C208*'Prosjektbeskrivelse og inndata'!C12*Reasfaltering!G8","v":0},"kWh",{"$f":"Beregningsfaktorer!D50","v":7},"Reasfaltering","Elektrisitet",{"$f":"Utslippsfaktorer!B24","v":"Elektrisitet 55 år, europeisk miks"},{"$f":"SUMIF(Utslippsfaktorer!B:B,Beregninger!J211,Utslippsfaktorer!D:D)","v":0.13600000000000001},{"$f":"VLOOKUP(J211,Utslippsfaktorer!B:C,2,FALSE)","v":"kg CO2e/kWh"},0,{"$f":"SUMIF($O$125:$BV$125,\"<=\" & 'Prosjektbeskrivelse og inndata'!$C$14,O211:BL211)","v":0},"","","","","","",0,"","","","","","",0,"","","","","","",0,"","","","","","",0,"","","","","","",0,"","","","","","",0,"","","","","","",0,"","","","","","",0,"","","",""]
[null,null,null,"Reasfaltering diesel",{"$f":"C208*'Prosjektbeskrivelse og inndata'!C12*Reasfaltering!E8","v":7.1073854999999995},"liter diesel",{"$f":"Beregningsfaktorer!D50","v":7},"Reasfaltering","Diesel",{"$f":"Utslippsfaktorer!B20","v":"Fossil diesel (WTW)"},{"$f":"SUMIF(Utslippsfaktorer!B:B,Beregninger!J212,Utslippsfaktorer!D:D)","v":3.24},{"$f":"VLOOKUP(J212,Utslippsfaktorer!B:C,2,FALSE)","v":"kg CO2e/liter"},2.3027929019999997E-2,{"$f":"SUMIF($O$125:$BV$125,\"<=\" & 'Prosjektbeskrivelse og inndata'!$C$14,O212:BL212)","v":0.18422343216000001},"","","","","","",2.3027929019999997E-2,"","","","","","",2.3027929019999997E-2,"","","","","","",2.3027929019999997E-2,"","","","","","",2.3027929019999997E-2,"","","","","","",2.3027929019999997E-2,"","","","","","",2.3027929019999997E-2,"","","","","","",2.3027929019999997E-2,"","","","","","",2.3027929019999997E-2,"","","",""]
[null,null,null,"Reasfaltering biodiesel",{"$f":"C208*'Prosjektbeskrivelse og inndata'!C12*Reasfaltering!F8","v":0.53496450000000006},"liter biodiesel",{"$f":"Beregningsfaktorer!D50","v":7},"Reasfaltering","Biodiesel",{"$f":"Utslippsfaktorer!B18","v":"Biodiesel (WTT)"},{"$f":"SUMIF(Utslippsfaktorer!B:B,Beregninger!J213,Utslippsfaktorer!D:D)","v":1.92},{"$f":"VLOOKUP(J213,Utslippsfaktorer!B:C,2,FALSE)","v":"kg CO2e/liter"},1.02713184E-3,{"$f":"SUMIF($O$125:$BV$125,\"<=\" & 'Prosjektbeskrivelse og inndata'!$C$14,O213:BL213)","v":8.2170547200000003E-3},"","","","","","",1.02713184E-3,"","","","","","",1.02713184E-3,"","","","","","",1.02713184E-3,"","","","","","",1.02713184E-3,"","","","","","",1.02713184E-3,"","","","","","",1.02713184E-3,"","","","","","",1.02713184E-3,"","","","","","",1.02713184E-3,"","","",""]
[null,null,null,"Reasfaltering elektrisk/hydrogen",{"$f":"C208*'Prosjektbeskrivelse og inndata'!C12*Reasfaltering!G8","v":0},"kWh",{"$f":"Beregningsfaktorer!D50","v":7},"Reasfaltering","Elektrisitet",{"$f":"Utslippsfaktorer!B24","v":"Elektrisitet 55 år, europeisk miks"},{"$f":"SUMIF(Utslippsfaktorer!B:B,Beregninger!J214,Utslippsfaktorer!D:D)","v":0.13600000000000001},{"$f":"VLOOKUP(J214,Utslippsfaktorer!B:C,2,FALSE)","v":"kg CO2e/kWh"},0,{"$f":"SUMIF($O$125:$BV$125,\"<=\" & 'Prosjektbeskrivelse og inndata'!$C$14,O214:BL214)","v":0},"","","","","","",0,"","","","","","",0,"","","","","","",0,"","","","","","",0,"","","","","","",0,"","","","","","",0,"","","","","","",0,"","","","","","",0,"","","",""]
[null,null,null,"Feiing diesel",{"$f":"C208*'Drift og vedlikehold'!E26*Beregningsfaktorer!D79","v":0.61937999999999993},"liter diesel",1,"Drift","Diesel",{"$f":"Utslippsfaktorer!B20","v":"Fossil diesel (WTW)"},{"$f":"SUMIF(Utslippsfaktorer!B:B,Beregninger!J215,Utslippsfaktorer!D:D)","v":3.24},{"$f":"VLOOKUP(J215,Utslippsfaktorer!B:C,2,FALSE)","v":"kg CO2e/liter"},2.0067912E-3,{"$f":"SUMIF($O$125:$BV$125,\"<=\" & 'Prosjektbeskrivelse og inndata'!$C$14,O215:BL215)","v":0.12040747199999985},2.0067912E-3,2.0067912E-3,2.0067912E-3,2.0067912E-3,2.0067912E-3,2.0067912E-3,2.0067912E-3,2.0067912E-3,2.0067912E-3,2.0067912E-3,2.0067912E-3,2.0067912E-3,2.0067912E-3,2.0067912E-3,2.0067912E-3,2.0067912E-3,2.0067912E-3,2.0067912E-3,2.0067912E-3,2.0067912E-3,2.0067912E-3,2.0067912E-3,2.0067912E-3,2.0067912E-3,2.0067912E-3,2.0067912E-3,2.0067912E-3,2.0067912E-3,2.0067912E-3,2.0067912E-3,2.0067912E-3,2.0067912E-3,2.0067912E-3,2.0067912E-3,2.0067912E-3,2.0067912E-3,2.0067912E-3,2.0067912E-3,2.0067912E-3,2.0067912E-3,2.0067912E-3,2.0067912E-3,2.0067912E-3,2.0067912E-3,2.0067912E-3,2.0067912E-3,2.0067912E-3,2.0067912E-3,2.0067912E-3,2.0067912E-3,2.0067912E-3,2.0067912E-3,2.0067912E-3,2.0067912E-3,2.0067912E-3,2.0067912E-3,2.0067912E-3,2.0067912E-3,2.0067912E-3,2.0067912E-3]
[null,null,null,"Feiing biodiesel",{"$f":"C208*'Drift og vedlikehold'!F26*Beregningsfaktorer!D79","v":4.6620000000000009E-2},"liter biodiesel",1,"Drift","Biodiesel",{"$f":"Utslippsfaktorer!B18","v":"Biodiesel (WTT)"},{"$f":"SUMIF(Utslippsfaktorer!B:B,Beregninger!J216,Utslippsfaktorer!D:D)","v":1.92},{"$f":"VLOOKUP(J216,Utslippsfaktorer!B:C,2,FALSE)","v":"kg CO2e/liter"},8.9510400000000016E-5,{"$f":"SUMIF($O$125:$BV$125,\"<=\" & 'Prosjektbeskrivelse og inndata'!$C$14,O216:BL216)","v":5.3706240000000001E-3},{"$f":"IF(MOD(O$125,$G216)=0,$M216,\"\")","v":8.9510400000000016E-5},8.9510400000000016E-5,8.9510400000000016E-5,8.9510400000000016E-5,8.9510400000000016E-5,8.9510400000000016E-5,8.9510400000000016E-5,8.9510400000000016E-5,8.9510400000000016E-5,8.9510400000000016E-5,{"$f":"IF(MOD(Y$125,$G216)=0,$M216,\"\")","v":8.9510400000000016E-5},8.9510400000000016E-5,8.9510400000000016E-5,8.9510400000000016E-5,8.9510400000000016E-5,8.9510400000000016E-5,8.9510400000000016E-5,8.9510400000000016E-5,8.9510400000000016E-5,8.9510400000000016E-5,{"$f":"IF(MOD(AI$125,$G216)=0,$M216,\"\")","v":8.9510400000000016E-5},8.9510400000000016E-5,8.9510400000000016E-5,8.9510400000000016E-5,8.9510400000000016E-5,8.9510400000000016E-5,8.9510400000000016E-5,8.9510400000000016E-5,8.9510400000000016E-5,8.9510400000000016E-5,{"$f":"IF(MOD(AS$125,$G216)=0,$M216,\"\")","v":8.9510400000000016E-5},8.9510400000000016E-5,8.9510400000000016E-5,8.9510400000000016E-5,8.9510400000000016E-5,8.9510400000000016E-5,8.9510400000000016E-5,8.9510400000000016E-5,8.9510400000000016E-5,8.9510400000000016E-5,{"$f":"IF(MOD(BC$125,$G216)=0,$M216,\"\")","v":8.9510400000000016E-5},8.9510400000000016E-5,8.9510400000000016E-5,8.9510400000000016E-5,8.9510400000000016E-5,8.9510400000000016E-5,8.9510400000000016E-5,8.9510400000000016E-5,8.9510400000000016E-5,8.9510400000000016E-5,{"$f":"IF(MOD(BM$125,$G216)=0,$M216,\"\")","v":8.9510400000000016E-5},8.9510400000000016E-5,8.9510400000000016E-5,8.9510400000000016E-5,8.9510400000000016E-5,8.9510400000000016E-5,8.9510400000000016E-5,8.9510400000000016E-5,8.9510400000000016E-5,8.9510400000000016E-5]
[null,null,null,"Feiing elektrisk/hydrogen",{"$f":"C208*'Drift og vedlikehold'!G26*Beregningsfaktorer!D79","v":0},"kWh",1,"Drift","Elektrisitet",{"$f":"Utslippsfaktorer!B24","v":"Elektrisitet 55 år, europeisk miks"},{"$f":"SUMIF(Utslippsfaktorer!B:B,Beregninger!J217,Utslippsfaktorer!D:D)","v":0.13600000000000001},{"$f":"VLOOKUP(J217,Utslippsfaktorer!B:C,2,FALSE)","v":"kg CO2e/kWh"},0,{"$f":"SUMIF($O$125:$BV$125,\"<=\" & 'Prosjektbeskrivelse og inndata'!$C$14,O217:BL217)","v":0},0,0,0,0,0,0,0,0,0,0,0,0,0,0,0,0,0,0,0,0,0,0,0,0,0,0,0,0,0,0,0,0,0,0,0,0,0,0,0,0,0,0,0,0,0,0,0,0,0,0,0,0,0,0,0,0,0,0,0,0]
[null,null,null,"Salting diesel",{"$f":"C208*'Drift og vedlikehold'!E27*(Beregningsfaktorer!D79/2)","v":5.2853759999999994},"liter diesel",1,"Drift","Diesel",{"$f":"Utslippsfaktorer!B20","v":"Fossil diesel (WTW)"},{"$f":"SUMIF(Utslippsfaktorer!B:B,Beregninger!J218,Utslippsfaktorer!D:D)","v":3.24},{"$f":"VLOOKUP(J218,Utslippsfaktorer!B:C,2,FALSE)","v":"kg CO2e/liter"},1.712461824E-2,{"$f":"SUMIF($O$125:$BV$125,\"<=\" & 'Prosjektbeskrivelse og inndata'!$C$14,O218:BL218)","v":1.0274770944},1.712461824E-2,1.712461824E-2,1.712461824E-2,1.712461824E-2,1.712461824E-2,1.712461824E-2,1.712461824E-2,1.712461824E-2,1.712461824E-2,1.712461824E-2,1.712461824E-2,1.712461824E-2,1.712461824E-2,1.712461824E-2,1.712461824E-2,1.712461824E-2,1.712461824E-2,1.712461824E-2,1.712461824E-2,1.712461824E-2,1.712461824E-2,1.712461824E-2,1.712461824E-2,1.712461824E-2,1.712461824E-2,1.712461824E-2,1.712461824E-2,1.712461824E-2,1.712461824E-2,1.712461824E-2,1.712461824E-2,1.712461824E-2,1.712461824E-2,1.712461824E-2,1.712461824E-2,1.712461824E-2,1.712461824E-2,1.712461824E-2,1.712461824E-2,1.712461824E-2,1.712461824E-2,1.712461824E-2,1.712461824E-2,1.712461824E-2,1.712461824E-2,1.712461824E-2,1.712461824E-2,1.712461824E-2,1.712461824E-2,1.712461824E-2,1.712461824E-2,1.712461824E-2,1.712461824E-2,1.712461824E-2,1.712461824E-2,1.712461824E-2,1.712461824E-2,1.712461824E-2,1.712461824E-2,1.712461824E-2]
[null,null,null,"Salting biodiesel",{"$f":"C208*'Drift og vedlikehold'!F27*(Beregningsfaktorer!D79/2)","v":0.39782400000000001},"liter biodiesel",1,"Drift","Biodiesel",{"$f":"Utslippsfaktorer!B18","v":"Biodiesel (WTT)"},{"$f":"SUMIF(Utslippsfaktorer!B:B,Beregninger!J219,Utslippsfaktorer!D:D)","v":1.92},{"$f":"VLOOKUP(J219,Utslippsfaktorer!B:C,2,FALSE)","v":"kg CO2e/liter"},7.6382207999999994E-4,{"$f":"SUMIF($O$125:$BV$125,\"<=\" & 'Prosjektbeskrivelse og inndata'!$C$14,O219:BL219)","v":4.5829324799999953E-2},7.6382207999999994E-4,7.6382207999999994E-4,7.6382207999999994E-4,7.6382207999999994E-4,7.6382207999999994E-4,7.6382207999999994E-4,7.6382207999999994E-4,7.6382207999999994E-4,7.6382207999999994E-4,7.6382207999999994E-4,7.6382207999999994E-4,7.6382207999999994E-4,7.6382207999999994E-4,7.6382207999999994E-4,7.6382207999999994E-4,7.6382207999999994E-4,7.6382207999999994E-4,7.6382207999999994E-4,7.6382207999999994E-4,7.6382207999999994E-4,7.6382207999999994E-4,7.6382207999999994E-4,7.6382207999999994E-4,7.6382207999999994E-4,7.6382207999999994E-4,7.6382207999999994E-4,7.6382207999999994E-4,7.6382207999999994E-4,7.6382207999999994E-4,7.6382207999999994E-4,7.6382207999999994E-4,7.6382207999999994E-4,7.6382207999999994E-4,7.6382207999999994E-4,7.6382207999999994E-4,7.6382207999999994E-4,7.6382207999999994E-4,7.6382207999999994E-4,7.6382207999999994E-4,7.6382207999999994E-4,7.6382207999999994E-4,7.6382207999999994E-4,7.6382207999999994E-4,7.6382207999999994E-4,7.6382207999999994E-4,7.6382207999999994E-4,7.6382207999999994E-4,7.6382207999999994E-4,7.6382207999999994E-4,7.6382207999999994E-4,7.6382207999999994E-4,7.6382207999999994E-4,7.6382207999999994E-4,7.6382207999999994E-4,7.6382207999999994E-4,7.6382207999999994E-4,7.6382207999999994E-4,7.6382207999999994E-4,7.6382207999999994E-4,7.6382207999999994E-4]
[null,null,null,"Salting elektrisk/hydrogen",{"$f":"C208*'Drift og vedlikehold'!G27*(Beregningsfaktorer!D79/2)","v":0},"kWh",1,"Drift","Elektrisitet",{"$f":"Utslippsfaktorer!B24","v":"Elektrisitet 55 år, europeisk miks"},{"$f":"SUMIF(Utslippsfaktorer!B:B,Beregninger!J220,Utslippsfaktorer!D:D)","v":0.13600000000000001},{"$f":"VLOOKUP(J220,Utslippsfaktorer!B:C,2,FALSE)","v":"kg CO2e/kWh"},0,{"$f":"SUMIF($O$125:$BV$125,\"<=\" & 'Prosjektbeskrivelse og inndata'!$C$14,O220:BL220)","v":0},0,0,0,0,0,0,0,0,0,0,0,0,0,0,0,0,0,0,0,0,0,0,0,0,0,0,0,0,0,0,0,0,0,0,0,0,0,0,0,0,0,0,0,0,0,0,0,0,0,0,0,0,0,0,0,0,0,0,0,0]
[null,null,null,"Salt",{"$f":"C208*'Drift og vedlikehold'!E16","v":466.2},"kg salt",1,"Drift","Salt",{"$f":"Utslippsfaktorer!B12","v":"Salt"},{"$f":"SUMIF(Utslippsfaktorer!B:B,Beregninger!J221,Utslippsfaktorer!D:D)","v":0.17899999999999999},{"$f":"VLOOKUP(J221,Utslippsfaktorer!B:C,2,FALSE)","v":"kg CO2e/kg"},8.3449799999999991E-2,{"$f":"SUMIF($O$125:$BV$125,\"<=\" & 'Prosjektbeskrivelse og inndata'!$C$14,O221:BL221)","v":5.0069880000000015},8.3449799999999991E-2,8.3449799999999991E-2,8.3449799999999991E-2,8.3449799999999991E-2,8.3449799999999991E-2,8.3449799999999991E-2,8.3449799999999991E-2,8.3449799999999991E-2,8.3449799999999991E-2,8.3449799999999991E-2,8.3449799999999991E-2,8.3449799999999991E-2,8.3449799999999991E-2,8.3449799999999991E-2,8.3449799999999991E-2,8.3449799999999991E-2,8.3449799999999991E-2,8.3449799999999991E-2,8.3449799999999991E-2,8.3449799999999991E-2,8.3449799999999991E-2,8.3449799999999991E-2,8.3449799999999991E-2,8.3449799999999991E-2,8.3449799999999991E-2,8.3449799999999991E-2,8.3449799999999991E-2,8.3449799999999991E-2,8.3449799999999991E-2,8.3449799999999991E-2,8.3449799999999991E-2,8.3449799999999991E-2,8.3449799999999991E-2,8.3449799999999991E-2,8.3449799999999991E-2,8.3449799999999991E-2,8.3449799999999991E-2,8.3449799999999991E-2,8.3449799999999991E-2,8.3449799999999991E-2,8.3449799999999991E-2,8.3449799999999991E-2,8.3449799999999991E-2,8.3449799999999991E-2,8.3449799999999991E-2,8.3449799999999991E-2,8.3449799999999991E-2,8.3449799999999991E-2,8.3449799999999991E-2,8.3449799999999991E-2,8.3449799999999991E-2,8.3449799999999991E-2,8.3449799999999991E-2,8.3449799999999991E-2,8.3449799999999991E-2,8.3449799999999991E-2,8.3449799999999991E-2,8.3449799999999991E-2,8.3449799999999991E-2,8.3449799999999991E-2]
[null,null,null,"Salttransport diesel",{"$f":"C208*'Drift og vedlikehold'!F16","v":4.335659999999999},"liter diesel",1,"Drift","Diesel",{"$f":"Utslippsfaktorer!B20","v":"Fossil diesel (WTW)"},{"$f":"SUMIF(Utslippsfaktorer!B:B,Beregninger!J222,Utslippsfaktorer!D:D)","v":3.24},{"$f":"VLOOKUP(J222,Utslippsfaktorer!B:C,2,FALSE)","v":"kg CO2e/liter"},1.4047538399999997E-2,{"$f":"SUMIF($O$125:$BV$125,\"<=\" & 'Prosjektbeskrivelse og inndata'!$C$14,O222:BL222)","v":0.84285230399999878},1.4047538399999997E-2,1.4047538399999997E-2,1.4047538399999997E-2,1.4047538399999997E-2,1.4047538399999997E-2,1.4047538399999997E-2,1.4047538399999997E-2,1.4047538399999997E-2,1.4047538399999997E-2,1.4047538399999997E-2,1.4047538399999997E-2,1.4047538399999997E-2,1.4047538399999997E-2,1.4047538399999997E-2,1.4047538399999997E-2,1.4047538399999997E-2,1.4047538399999997E-2,1.4047538399999997E-2,1.4047538399999997E-2,1.4047538399999997E-2,1.4047538399999997E-2,1.4047538399999997E-2,1.4047538399999997E-2,1.4047538399999997E-2,1.4047538399999997E-2,1.4047538399999997E-2,1.4047538399999997E-2,1.4047538399999997E-2,1.4047538399999997E-2,1.4047538399999997E-2,1.4047538399999997E-2,1.4047538399999997E-2,1.4047538399999997E-2,1.4047538399999997E-2,1.4047538399999997E-2,1.4047538399999997E-2,1.4047538399999997E-2,1.4047538399999997E-2,1.4047538399999997E-2,1.4047538399999997E-2,1.4047538399999997E-2,1.4047538399999997E-2,1.4047538399999997E-2,1.4047538399999997E-2,1.4047538399999997E-2,1.4047538399999997E-2,1.4047538399999997E-2,1.4047538399999997E-2,1.4047538399999997E-2,1.4047538399999997E-2,1.4047538399999997E-2,1.4047538399999997E-2,1.4047538399999997E-2,1.4047538399999997E-2,1.4047538399999997E-2,1.4047538399999997E-2,1.4047538399999997E-2,1.4047538399999997E-2,1.4047538399999997E-2,1.4047538399999997E-2]
[null,null,null,"Salttransport biodiesel",{"$f":"C208*'Drift og vedlikehold'!G16","v":0.32634000000000002},"liter biodiesel",1,"Drift","Biodiesel",{"$f":"Utslippsfaktorer!B18","v":"Biodiesel (WTT)"},{"$f":"SUMIF(Utslippsfaktorer!B:B,Beregninger!J223,Utslippsfaktorer!D:D)","v":1.92},{"$f":"VLOOKUP(J223,Utslippsfaktorer!B:C,2,FALSE)","v":"kg CO2e/liter"},6.2657279999999999E-4,{"$f":"SUMIF($O$125:$BV$125,\"<=\" & 'Prosjektbeskrivelse og inndata'!$C$14,O223:BL223)","v":3.7594367999999996E-2},6.2657279999999999E-4,6.2657279999999999E-4,6.2657279999999999E-4,6.2657279999999999E-4,6.2657279999999999E-4,6.2657279999999999E-4,6.2657279999999999E-4,6.2657279999999999E-4,6.2657279999999999E-4,6.2657279999999999E-4,6.2657279999999999E-4,6.2657279999999999E-4,6.2657279999999999E-4,6.2657279999999999E-4,6.2657279999999999E-4,6.2657279999999999E-4,6.2657279999999999E-4,6.2657279999999999E-4,6.2657279999999999E-4,6.2657279999999999E-4,6.2657279999999999E-4,6.2657279999999999E-4,6.2657279999999999E-4,6.2657279999999999E-4,6.2657279999999999E-4,6.2657279999999999E-4,6.2657279999999999E-4,6.2657279999999999E-4,6.2657279999999999E-4,6.2657279999999999E-4,6.2657279999999999E-4,6.2657279999999999E-4,6.2657279999999999E-4,6.2657279999999999E-4,6.2657279999999999E-4,6.2657279999999999E-4,6.2657279999999999E-4,6.2657279999999999E-4,6.2657279999999999E-4,6.2657279999999999E-4,6.2657279999999999E-4,6.2657279999999999E-4,6.2657279999999999E-4,6.2657279999999999E-4,6.2657279999999999E-4,6.2657279999999999E-4,6.2657279999999999E-4,6.2657279999999999E-4,6.2657279999999999E-4,6.2657279999999999E-4,6.2657279999999999E-4,6.2657279999999999E-4,6.2657279999999999E-4,6.2657279999999999E-4,6.2657279999999999E-4,6.2657279999999999E-4,6.2657279999999999E-4,6.2657279999999999E-4,6.2657279999999999E-4,6.2657279999999999E-4]
[null,null,null,"Salttransport elektrisk/hydrogen",{"$f":"C208*'Drift og vedlikehold'!H16","v":0},"kWh",1,"Drift","Elektrisitet",{"$f":"Utslippsfaktorer!B24","v":"Elektrisitet 55 år, europeisk miks"},{"$f":"SUMIF(Utslippsfaktorer!B:B,Beregninger!J224,Utslippsfaktorer!D:D)","v":0.13600000000000001},{"$f":"VLOOKUP(J224,Utslippsfaktorer!B:C,2,FALSE)","v":"kg CO2e/kWh"},0,{"$f":"SUMIF($O$125:$BV$125,\"<=\" & 'Prosjektbeskrivelse og inndata'!$C$14,O224:BL224)","v":0},0,0,0,0,0,0,0,0,0,0,0,0,0,0,0,0,0,0,0,0,0,0,0,0,0,0,0,0,0,0,0,0,0,0,0,0,0,0,0,0,0,0,0,0,0,0,0,0,0,0,0,0,0,0,0,0,0,0,0,0]
[null,null,null,"Brøyting diesel",{"$f":"C208*'Drift og vedlikehold'!E28","v":19.151559936000002},"liter diesel",1,"Drift","Diesel",{"$f":"Utslippsfaktorer!B20","v":"Fossil diesel (WTW)"},{"$f":"SUMIF(Utslippsfaktorer!B:B,Beregninger!J225,Utslippsfaktorer!D:D)","v":3.24},{"$f":"VLOOKUP(J225,Utslippsfaktorer!B:C,2,FALSE)","v":"kg CO2e/liter"},6.2051054192640009E-2,{"$f":"SUMIF($O$125:$BV$125,\"<=\" & 'Prosjektbeskrivelse og inndata'!$C$14,O225:BL225)","v":3.7230632515584006},6.2051054192640009E-2,6.2051054192640009E-2,6.2051054192640009E-2,6.2051054192640009E-2,6.2051054192640009E-2,6.2051054192640009E-2,6.2051054192640009E-2,6.2051054192640009E-2,6.2051054192640009E-2,6.2051054192640009E-2,6.2051054192640009E-2,6.2051054192640009E-2,6.2051054192640009E-2,6.2051054192640009E-2,6.2051054192640009E-2,6.2051054192640009E-2,6.2051054192640009E-2,6.2051054192640009E-2,6.2051054192640009E-2,6.2051054192640009E-2,6.2051054192640009E-2,6.2051054192640009E-2,6.2051054192640009E-2,6.2051054192640009E-2,6.2051054192640009E-2,6.2051054192640009E-2,6.2051054192640009E-2,6.2051054192640009E-2,6.2051054192640009E-2,6.2051054192640009E-2,6.2051054192640009E-2,6.2051054192640009E-2,6.2051054192640009E-2,6.2051054192640009E-2,6.2051054192640009E-2,6.2051054192640009E-2,6.2051054192640009E-2,6.2051054192640009E-2,6.2051054192640009E-2,6.2051054192640009E-2,6.2051054192640009E-2,6.2051054192640009E-2,6.2051054192640009E-2,6.2051054192640009E-2,6.2051054192640009E-2,6.2051054192640009E-2,6.2051054192640009E-2,6.2051054192640009E-2,6.2051054192640009E-2,6.2051054192640009E-2,6.2051054192640009E-2,6.2051054192640009E-2,6.2051054192640009E-2,6.2051054192640009E-2,6.2051054192640009E-2,6.2051054192640009E-2,6.2051054192640009E-2,6.2051054192640009E-2,6.2051054192640009E-2,6.2051054192640009E-2]
[null,null,null,"Brøyting biodiesel",{"$f":"C208*'Drift og vedlikehold'!F28","v":1.4415152640000002},"liter biodiesel",1,"Drift","Biodiesel",{"$f":"Utslippsfaktorer!B18","v":"Biodiesel (WTT)"},{"$f":"SUMIF(Utslippsfaktorer!B:B,Beregninger!J226,Utslippsfaktorer!D:D)","v":1.92},{"$f":"VLOOKUP(J226,Utslippsfaktorer!B:C,2,FALSE)","v":"kg CO2e/liter"},2.7677093068799999E-3,{"$f":"SUMIF($O$125:$BV$125,\"<=\" & 'Prosjektbeskrivelse og inndata'!$C$14,O226:BL226)","v":0.16606255841280002},{"$f":"IF(MOD(O$125,$G226)=0,$M226,\"\")","v":2.7677093068799999E-3},2.7677093068799999E-3,2.7677093068799999E-3,2.7677093068799999E-3,2.7677093068799999E-3,2.7677093068799999E-3,2.7677093068799999E-3,2.7677093068799999E-3,2.7677093068799999E-3,2.7677093068799999E-3,{"$f":"IF(MOD(Y$125,$G226)=0,$M226,\"\")","v":2.7677093068799999E-3},2.7677093068799999E-3,2.7677093068799999E-3,2.7677093068799999E-3,2.7677093068799999E-3,2.7677093068799999E-3,2.7677093068799999E-3,2.7677093068799999E-3,2.7677093068799999E-3,2.7677093068799999E-3,{"$f":"IF(MOD(AI$125,$G226)=0,$M226,\"\")","v":2.7677093068799999E-3},2.7677093068799999E-3,2.7677093068799999E-3,2.7677093068799999E-3,2.7677093068799999E-3,2.7677093068799999E-3,2.7677093068799999E-3,2.7677093068799999E-3,2.7677093068799999E-3,2.7677093068799999E-3,{"$f":"IF(MOD(AS$125,$G226)=0,$M226,\"\")","v":2.7677093068799999E-3},2.7677093068799999E-3,2.7677093068799999E-3,2.7677093068799999E-3,2.7677093068799999E-3,2.7677093068799999E-3,2.7677093068799999E-3,2.7677093068799999E-3,2.7677093068799999E-3,2.7677093068799999E-3,{"$f":"IF(MOD(BC$125,$G226)=0,$M226,\"\")","v":2.7677093068799999E-3},2.7677093068799999E-3,2.7677093068799999E-3,2.7677093068799999E-3,2.7677093068799999E-3,2.7677093068799999E-3,2.7677093068799999E-3,2.7677093068799999E-3,2.7677093068799999E-3,2.7677093068799999E-3,{"$f":"IF(MOD(BM$125,$G226)=0,$M226,\"\")","v":2.7677093068799999E-3},2.7677093068799999E-3,2.7677093068799999E-3,2.7677093068799999E-3,2.7677093068799999E-3,2.7677093068799999E-3,2.7677093068799999E-3,2.7677093068799999E-3,2.7677093068799999E-3,2.7677093068799999E-3]
[null,null,null,"Brøyting elektrisk/hydrogen",{"$f":"C208*'Drift og vedlikehold'!G28","v":0},"kWh",1,"Drift","Elektrisitet",{"$f":"Utslippsfaktorer!B24","v":"Elektrisitet 55 år, europeisk miks"},{"$f":"SUMIF(Utslippsfaktorer!B:B,Beregninger!J227,Utslippsfaktorer!D:D)","v":0.13600000000000001},{"$f":"VLOOKUP(J227,Utslippsfaktorer!B:C,2,FALSE)","v":"kg CO2e/kWh"},0,{"$f":"SUMIF($O$125:$BV$125,\"<=\" & 'Prosjektbeskrivelse og inndata'!$C$14,O227:BL227)","v":0},0,0,0,0,0,0,0,0,0,0,0,0,0,0,0,0,0,0,0,0,0,0,0,0,0,0,0,0,0,0,0,0,0,0,0,0,0,0,0,0,0,0,0,0,0,0,0,0,0,0,0,0,0,0,0,0,0,0,0,0]
[null,null,null,"Autovern",{"$f":"C208*'Tillegg vei'!D7*Beregningsfaktorer!D83","v":2930.4},"kg stål",{"$f":"Beregningsfaktorer!D51","v":30},"Vedlikehold","Stål",{"$f":"Utslippsfaktorer!B14","v":"Stål"},{"$f":"SUMIF(Utslippsfaktorer!B:B,Beregninger!J228,Utslippsfaktorer!D:D)","v":2.1234999999999999},{"$f":"VLOOKUP(J228,Utslippsfaktorer!B:C,2,FALSE)","v":"kg CO2e/kg"},6.2227043999999996,{"$f":"SUMIF($O$125:$BV$125,\"<=\" & 'Prosjektbeskrivelse og inndata'!$C$14,O228:BL228)","v":12.445408799999999},"","","","","","","","","","","","","","","","","","","","","","","","","","","","","",6.2227043999999996,"","","","","","","","","","","","","","","","","","","","","","","","","","","","","",6.2227043999999996]
[null,null,null,"Utskiftning autovern diesel",{"$f":"C208*'Tillegg vei'!E7*Beregningsfaktorer!D83","v":21.802175999999999},"liter diesel",{"$f":"Beregningsfaktorer!D51","v":30},"Vedlikehold","Diesel",{"$f":"Utslippsfaktorer!B20","v":"Fossil diesel (WTW)"},{"$f":"SUMIF(Utslippsfaktorer!B:B,Beregninger!J229,Utslippsfaktorer!D:D)","v":3.24},{"$f":"VLOOKUP(J229,Utslippsfaktorer!B:C,2,FALSE)","v":"kg CO2e/liter"},7.0639050240000001E-2,{"$f":"SUMIF($O$125:$BV$125,\"<=\" & 'Prosjektbeskrivelse og inndata'!$C$14,O229:BL229)","v":0.14127810048},"","","","","","","","","","","","","","","","","","","","","","","","","","","","","",7.0639050240000001E-2,"","","","","","","","","","","","","","","","","","","","","","","","","","","","","",7.0639050240000001E-2]
[null,null,null,"Utskiftning autovern biodiesel",{"$f":"C208*'Tillegg vei'!F7*Beregningsfaktorer!D83","v":1.6410240000000003},"liter biodiesel",{"$f":"Beregningsfaktorer!D51","v":30},"Vedlikehold","Biodiesel",{"$f":"Utslippsfaktorer!B18","v":"Biodiesel (WTT)"},{"$f":"SUMIF(Utslippsfaktorer!B:B,Beregninger!J230,Utslippsfaktorer!D:D)","v":1.92},{"$f":"VLOOKUP(J230,Utslippsfaktorer!B:C,2,FALSE)","v":"kg CO2e/liter"},3.1507660800000003E-3,{"$f":"SUMIF($O$125:$BV$125,\"<=\" & 'Prosjektbeskrivelse og inndata'!$C$14,O230:BL230)","v":6.3015321600000005E-3},"","","","","","","","","","","","","","","","","","","","","","","","","","","","","",3.1507660800000003E-3,"","","","","","","","","","","","","","","","","","","","","","","","","","","","","",3.1507660800000003E-3]
[null,null,null,"Utskiftning autovern elektrisk/hydrogen",{"$f":"C208*'Tillegg vei'!G7*Beregningsfaktorer!D83","v":0},"kWh",{"$f":"Beregningsfaktorer!D51","v":30},"Vedlikehold","Elektrisitet",{"$f":"Utslippsfaktorer!B24","v":"Elektrisitet 55 år, europeisk miks"},{"$f":"SUMIF(Utslippsfaktorer!B:B,Beregninger!J231,Utslippsfaktorer!D:D)","v":0.13600000000000001},{"$f":"VLOOKUP(J231,Utslippsfaktorer!B:C,2,FALSE)","v":"kg CO2e/kWh"},0,{"$f":"SUMIF($O$125:$BV$125,\"<=\" & 'Prosjektbeskrivelse og inndata'!$C$14,O231:BL231)","v":0},"","","","","","","","","","","","","","","","","","","","","","","","","","","","","",0,"","","","","","","","","","","","","","","","","","","","","","","","","","","","","",0]
[null,null,null,"Transport av autovern diesel",{"$f":"C208*'Drift og vedlikehold'!F19*Beregningsfaktorer!D83","v":21.802175999999999},"liter diesel",{"$f":"Beregningsfaktorer!D51","v":30},"Vedlikehold","Diesel",{"$f":"Utslippsfaktorer!B20","v":"Fossil diesel (WTW)"},{"$f":"SUMIF(Utslippsfaktorer!B:B,Beregninger!J232,Utslippsfaktorer!D:D)","v":3.24},{"$f":"VLOOKUP(J232,Utslippsfaktorer!B:C,2,FALSE)","v":"kg CO2e/liter"},7.0639050240000001E-2,{"$f":"SUMIF($O$125:$BV$125,\"<=\" & 'Prosjektbeskrivelse og inndata'!$C$14,O232:BL232)","v":0.14127810048},"","","","","","","","","","","","","","","","","","","","","","","","","","","","","",7.0639050240000001E-2,"","","","","","","","","","","","","","","","","","","","","","","","","","","","","",7.0639050240000001E-2]
[null,null,null,"Transport av autovern biodiesel",{"$f":"C208*'Drift og vedlikehold'!G19*Beregningsfaktorer!D83","v":1.6410240000000003},"liter biodiesel",{"$f":"Beregningsfaktorer!D51","v":30},"Vedlikehold","Biodiesel",{"$f":"Utslippsfaktorer!B18","v":"Biodiesel (WTT)"},{"$f":"SUMIF(Utslippsfaktorer!B:B,Beregninger!J233,Utslippsfaktorer!D:D)","v":1.92},{"$f":"VLOOKUP(J233,Utslippsfaktorer!B:C,2,FALSE)","v":"kg CO2e/liter"},3.1507660800000003E-3,{"$f":"SUMIF($O$125:$BV$125,\"<=\" & 'Prosjektbeskrivelse og inndata'!$C$14,O233:BL233)","v":6.3015321600000005E-3},"","","","","","","","","","","","","","","","","","","","","","","","","","","","","",3.1507660800000003E-3,"","","","","","","","","","","","","","","","","","","","","","","","","","","","","",3.1507660800000003E-3]
[null,null,null,"Transport av autovern elektrisk/hydrogen",{"$f":"C208*'Drift og vedlikehold'!H19*Beregningsfaktorer!D83","v":0},"kWh",{"$f":"Beregningsfaktorer!D51","v":30},"Vedlikehold","Elektrisitet",{"$f":"Utslippsfaktorer!B24","v":"Elektrisitet 55 år, europeisk miks"},{"$f":"SUMIF(Utslippsfaktorer!B:B,Beregninger!J234,Utslippsfaktorer!D:D)","v":0.13600000000000001},{"$f":"VLOOKUP(J234,Utslippsfaktorer!B:C,2,FALSE)","v":"kg CO2e/kWh"},0,{"$f":"SUMIF($O$125:$BV$125,\"<=\" & 'Prosjektbeskrivelse og inndata'!$C$14,O234:BL234)","v":0},"","","","","","","","","","","","","","","","","","","","","","","","","","","","","",0,"","","","","","","","","","","","","","","","","","","","","","","","","","","","","",0]
[null,null,null,"Lyktestolper",{"$f":"C208*'Tillegg vei'!D5*Beregningsfaktorer!D81","v":428.34900000000005},"kg stål",{"$f":"Beregningsfaktorer!D52","v":30},"Vedlikehold","Stål",{"$f":"Utslippsfaktorer!B14","v":"Stål"},{"$f":"SUMIF(Utslippsfaktorer!B:B,Beregninger!J235,Utslippsfaktorer!D:D)","v":2.1234999999999999},{"$f":"VLOOKUP(J235,Utslippsfaktorer!B:C,2,FALSE)","v":"kg CO2e/kg"},0.90959910150000012,{"$f":"SUMIF($O$125:$BV$125,\"<=\" & 'Prosjektbeskrivelse og inndata'!$C$14,O235:BL235)","v":1.8191982030000002},"","","","","","","","","","","","","","","","","","","","","","","","","","","","","",0.90959910150000012,"","","","","","","","","","","","","","","","","","","","","","","","","","","","","",0.90959910150000012]
[null,null,null,"Transport av lyktestolper diesel",{"$f":"C208*'Drift og vedlikehold'!F17*Beregningsfaktorer!D81","v":3.1869165600000002},"liter diesel",{"$f":"Beregningsfaktorer!D52","v":30},"Vedlikehold","Diesel",{"$f":"Utslippsfaktorer!B20","v":"Fossil diesel (WTW)"},{"$f":"SUMIF(Utslippsfaktorer!B:B,Beregninger!J236,Utslippsfaktorer!D:D)","v":3.24},{"$f":"VLOOKUP(J236,Utslippsfaktorer!B:C,2,FALSE)","v":"kg CO2e/liter"},1.0325609654400001E-2,{"$f":"SUMIF($O$125:$BV$125,\"<=\" & 'Prosjektbeskrivelse og inndata'!$C$14,O236:BL236)","v":2.0651219308800001E-2},{"$f":"IF(MOD(O$125,$G236)=0,$M236,\"\")","v":""},"","","","","","","","","",{"$f":"IF(MOD(Y$125,$G236)=0,$M236,\"\")","v":""},"","","","","","","","","",{"$f":"IF(MOD(AI$125,$G236)=0,$M236,\"\")","v":""},"","","","","","","","",1.0325609654400001E-2,{"$f":"IF(MOD(AS$125,$G236)=0,$M236,\"\")","v":""},"","","","","","","","","",{"$f":"IF(MOD(BC$125,$G236)=0,$M236,\"\")","v":""},"","","","","","","","","",{"$f":"IF(MOD(BM$125,$G236)=0,$M236,\"\")","v":""},"","","","","","","","",1.0325609654400001E-2]
[null,null,null,"Transport av lyktestolper biodiesel",{"$f":"C208*'Drift og vedlikehold'!G17*Beregningsfaktorer!D81","v":0.23987544000000005},"liter biodiesel",{"$f":"Beregningsfaktorer!D52","v":30},"Vedlikehold","Biodiesel",{"$f":"Utslippsfaktorer!B18","v":"Biodiesel (WTT)"},{"$f":"SUMIF(Utslippsfaktorer!B:B,Beregninger!J237,Utslippsfaktorer!D:D)","v":1.92},{"$f":"VLOOKUP(J237,Utslippsfaktorer!B:C,2,FALSE)","v":"kg CO2e/liter"},4.6056084480000008E-4,{"$f":"SUMIF($O$125:$BV$125,\"<=\" & 'Prosjektbeskrivelse og inndata'!$C$14,O237:BL237)","v":9.2112168960000016E-4},"","","","","","","","","","","","","","","","","","","","","","","","","","","","","",4.6056084480000008E-4,"","","","","","","","","","","","","","","","","","","","","","","","","","","","","",4.6056084480000008E-4]
[null,null,null,"Transport av lyktestolper elektrisk/hydrogen",{"$f":"C208*'Drift og vedlikehold'!H17*Beregningsfaktorer!D81","v":0},"kWh",{"$f":"Beregningsfaktorer!D52","v":30},"Vedlikehold","Elektrisitet",{"$f":"Utslippsfaktorer!B24","v":"Elektrisitet 55 år, europeisk miks"},{"$f":"SUMIF(Utslippsfaktorer!B:B,Beregninger!J238,Utslippsfaktorer!D:D)","v":0.13600000000000001},{"$f":"VLOOKUP(J238,Utslippsfaktorer!B:C,2,FALSE)","v":"kg CO2e/kWh"},0,{"$f":"SUMIF($O$125:$BV$125,\"<=\" & 'Prosjektbeskrivelse og inndata'!$C$14,O238:BL238)","v":0},"","","","","","","","","","","","","","","","","","","","","","","","","","","","","",0,"","","","","","","","","","","","","","","","","","","","","","","","","","","","","",0]
[null,null,null,"Belysning vei i dagen",{"$f":"C208*'Drift og vedlikehold'!H8*Beregningsfaktorer!D81","v":3019.2},"kWh",1,"Drift","Elektrisitet",{"$f":"Utslippsfaktorer!B24","v":"Elektrisitet 55 år, europeisk miks"},{"$f":"SUMIF(Utslippsfaktorer!B:B,Beregninger!J239,Utslippsfaktorer!D:D)","v":0.13600000000000001},{"$f":"VLOOKUP(J239,Utslippsfaktorer!B:C,2,FALSE)","v":"kg CO2e/kWh"},0.41061120000000001,{"$f":"SUMIF($O$125:$BV$125,\"<=\" & 'Prosjektbeskrivelse og inndata'!$C$14,O239:BL239)","v":24.636672000000036},0.41061120000000001,0.41061120000000001,0.41061120000000001,0.41061120000000001,0.41061120000000001,0.41061120000000001,0.41061120000000001,0.41061120000000001,0.41061120000000001,0.41061120000000001,0.41061120000000001,0.41061120000000001,0.41061120000000001,0.41061120000000001,0.41061120000000001,0.41061120000000001,0.41061120000000001,0.41061120000000001,0.41061120000000001,0.41061120000000001,0.41061120000000001,0.41061120000000001,0.41061120000000001,0.41061120000000001,0.41061120000000001,0.41061120000000001,0.41061120000000001,0.41061120000000001,0.41061120000000001,0.41061120000000001,0.41061120000000001,0.41061120000000001,0.41061120000000001,0.41061120000000001,0.41061120000000001,0.41061120000000001,0.41061120000000001,0.41061120000000001,0.41061120000000001,0.41061120000000001,0.41061120000000001,0.41061120000000001,0.41061120000000001,0.41061120000000001,0.41061120000000001,0.41061120000000001,0.41061120000000001,0.41061120000000001,0.41061120000000001,0.41061120000000001,0.41061120000000001,0.41061120000000001,0.41061120000000001,0.41061120000000001,0.41061120000000001,0.41061120000000001,0.41061120000000001,0.41061120000000001,0.41061120000000001,0.41061120000000001]
[null,"Drift stålbru (m)",{"$f":"SUMIF('Prosjektbeskrivelse og inndata'!$M:$M,B74,'Prosjektbeskrivelse og inndata'!$L:$L)","v":0},"Asfalt til reasfaltering",{"$f":"C240*'Prosjektbeskrivelse og inndata'!C13*Reasfaltering!D8","v":0},"kg skjelettasfalt",{"$f":"Beregningsfaktorer!D50","v":7},"Reasfaltering","Asfalt",{"$f":"Utslippsfaktorer!B7","v":"Skjelettasfalt (Ska)"},{"$f":"SUMIF(Utslippsfaktorer!B:B,Beregninger!J240,Utslippsfaktorer!D:D)","v":6.5699999999999995E-2},{"$f":"VLOOKUP(J240,Utslippsfaktorer!B:C,2,FALSE)","v":"kg CO2e/kg"},0,{"$f":"SUMIF($O$125:$BV$125,\"<=\" & 'Prosjektbeskrivelse og inndata'!$C$14,O240:BL240)","v":0},"","","","","","",0,"","","","","","",0,"","","","","","",0,"","","","","","",0,"","","","","","",0,"","","","","","",0,"","","","","","",0,"","","","","","",0,"","","",""]
[null,null,null,"Transport av asfalt diesel",{"$f":"C240*'Prosjektbeskrivelse og inndata'!C13*Reasfaltering!E8","v":0},"liter diesel",{"$f":"Beregningsfaktorer!D50","v":7},"Reasfaltering","Diesel",{"$f":"Utslippsfaktorer!B20","v":"Fossil diesel (WTW)"},{"$f":"SUMIF(Utslippsfaktorer!B:B,Beregninger!J241,Utslippsfaktorer!D:D)","v":3.24},{"$f":"VLOOKUP(J241,Utslippsfaktorer!B:C,2,FALSE)","v":"kg CO2e/liter"},0,{"$f":"SUMIF($O$125:$BV$125,\"<=\" & 'Prosjektbeskrivelse og inndata'!$C$14,O241:BL241)","v":0},"","","","","","",0,"","","","","","",0,"","","","","","",0,"","","","","","",0,"","","","","","",0,"","","","","","",0,"","","","","","",0,"","","","","","",0,"","","",""]
[null,null,null,"Transport av asfalt biodiesel",{"$f":"C240*'Prosjektbeskrivelse og inndata'!C13*Reasfaltering!F8","v":0},"liter biodiesel",{"$f":"Beregningsfaktorer!D50","v":7},"Reasfaltering","Biodiesel",{"$f":"Utslippsfaktorer!B18","v":"Biodiesel (WTT)"},{"$f":"SUMIF(Utslippsfaktorer!B:B,Beregninger!J242,Utslippsfaktorer!D:D)","v":1.92},{"$f":"VLOOKUP(J242,Utslippsfaktorer!B:C,2,FALSE)","v":"kg CO2e/liter"},0,{"$f":"SUMIF($O$125:$BV$125,\"<=\" & 'Prosjektbeskrivelse og inndata'!$C$14,O242:BL242)","v":0},"","","","","","",0,"","","","","","",0,"","","","","","",0,"","","","","","",0,"","","","","","",0,"","","","","","",0,"","","","","","",0,"","","","","","",0,"","","",""]
[null,null,null,"Transport av asfalt elektrisk/hydrogen",{"$f":"C240*'Prosjektbeskrivelse og inndata'!C13*Reasfaltering!G8","v":0},"kWh",{"$f":"Beregningsfaktorer!D50","v":7},"Reasfaltering","Elektrisitet",{"$f":"Utslippsfaktorer!B24","v":"Elektrisitet 55 år, europeisk miks"},{"$f":"SUMIF(Utslippsfaktorer!B:B,Beregninger!J243,Utslippsfaktorer!D:D)","v":0.13600000000000001},{"$f":"VLOOKUP(J243,Utslippsfaktorer!B:C,2,FALSE)","v":"kg CO2e/kWh"},0,{"$f":"SUMIF($O$125:$BV$125,\"<=\" & 'Prosjektbeskrivelse og inndata'!$C$14,O243:BL243)","v":0},"","","","","","",0,"","","","","","",0,"","","","","","",0,"","","","","","",0,"","","","","","",0,"","","","","","",0,"","","","","","",0,"","","","","","",0,"","","",""]
[null,null,null,"Reasfaltering diesel",{"$f":"C240*'Prosjektbeskrivelse og inndata'!C13*Reasfaltering!E8","v":0},"liter diesel",{"$f":"Beregningsfaktorer!D50","v":7},"Reasfaltering","Diesel",{"$f":"Utslippsfaktorer!B20","v":"Fossil diesel (WTW)"},{"$f":"SUMIF(Utslippsfaktorer!B:B,Beregninger!J244,Utslippsfaktorer!D:D)","v":3.24},{"$f":"VLOOKUP(J244,Utslippsfaktorer!B:C,2,FALSE)","v":"kg CO2e/liter"},0,{"$f":"SUMIF($O$125:$BV$125,\"<=\" & 'Prosjektbeskrivelse og inndata'!$C$14,O244:BL244)","v":0},"","","","","","",0,"","","","","","",0,"","","","","","",0,"","","","","","",0,"","","","","","",0,"","","","","","",0,"","","","","","",0,"","","","","","",0,"","","",""]
[null,null,null,"Reasfaltering biodiesel",{"$f":"C240*'Prosjektbeskrivelse og inndata'!C13*Reasfaltering!F8","v":0},"liter biodiesel",{"$f":"Beregningsfaktorer!D50","v":7},"Reasfaltering","Biodiesel",{"$f":"Utslippsfaktorer!B18","v":"Biodiesel (WTT)"},{"$f":"SUMIF(Utslippsfaktorer!B:B,Beregninger!J245,Utslippsfaktorer!D:D)","v":1.92},{"$f":"VLOOKUP(J245,Utslippsfaktorer!B:C,2,FALSE)","v":"kg CO2e/liter"},0,{"$f":"SUMIF($O$125:$BV$125,\"<=\" & 'Prosjektbeskrivelse og inndata'!$C$14,O245:BL245)","v":0},"","","","","","",0,"","","","","","",0,"","","","","","",0,"","","","","","",0,"","","","","","",0,"","","","","","",0,"","","","","","",0,"","","","","","",0,"","","",""]
[null,null,null,"Reasfaltering elektrisk/hydrogen",{"$f":"C240*'Prosjektbeskrivelse og inndata'!C13*Reasfaltering!G8","v":0},"kWh",{"$f":"Beregningsfaktorer!D50","v":7},"Reasfaltering","Elektrisitet",{"$f":"Utslippsfaktorer!B24","v":"Elektrisitet 55 år, europeisk miks"},{"$f":"SUMIF(Utslippsfaktorer!B:B,Beregninger!J246,Utslippsfaktorer!D:D)","v":0.13600000000000001},{"$f":"VLOOKUP(J246,Utslippsfaktorer!B:C,2,FALSE)","v":"kg CO2e/kWh"},0,{"$f":"SUMIF($O$125:$BV$125,\"<=\" & 'Prosjektbeskrivelse og inndata'!$C$14,O246:BL246)","v":0},{"$f":"IF(MOD(O$125,$G246)=0,$M246,\"\")","v":""},"","","","","",0,"","","",{"$f":"IF(MOD(Y$125,$G246)=0,$M246,\"\")","v":""},"","",0,"","","","","","",{"$f":"IF(MOD(AI$125,$G246)=0,$M246,\"\")","v":0},"","","","","","",0,"","",{"$f":"IF(MOD(AS$125,$G246)=0,$M246,\"\")","v":""},"","","",0,"","","","","",{"$f":"IF(MOD(BC$125,$G246)=0,$M246,\"\")","v":""},0,"","","","","","",0,"",{"$f":"IF(MOD(BM$125,$G246)=0,$M246,\"\")","v":""},"","","","",0,"","","",""]
[null,null,null,"Feiing diesel",{"$f":"C240*'Drift og vedlikehold'!E26*Beregningsfaktorer!D79","v":0},"liter diesel",1,"Drift","Diesel",{"$f":"Utslippsfaktorer!B20","v":"Fossil diesel (WTW)"},{"$f":"SUMIF(Utslippsfaktorer!B:B,Beregninger!J247,Utslippsfaktorer!D:D)","v":3.24},{"$f":"VLOOKUP(J247,Utslippsfaktorer!B:C,2,FALSE)","v":"kg CO2e/liter"},0,{"$f":"SUMIF($O$125:$BV$125,\"<=\" & 'Prosjektbeskrivelse og inndata'!$C$14,O247:BL247)","v":0},0,0,0,0,0,0,0,0,0,0,0,0,0,0,0,0,0,0,0,0,0,0,0,0,0,0,0,0,0,0,0,0,0,0,0,0,0,0,0,0,0,0,0,0,0,0,0,0,0,0,0,0,0,0,0,0,0,0,0,0]
[null,null,null,"Feiing biodiesel",{"$f":"C240*'Drift og vedlikehold'!F26*Beregningsfaktorer!D79","v":0},"liter biodiesel",1,"Drift","Biodiesel",{"$f":"Utslippsfaktorer!B18","v":"Biodiesel (WTT)"},{"$f":"SUMIF(Utslippsfaktorer!B:B,Beregninger!J248,Utslippsfaktorer!D:D)","v":1.92},{"$f":"VLOOKUP(J248,Utslippsfaktorer!B:C,2,FALSE)","v":"kg CO2e/liter"},0,{"$f":"SUMIF($O$125:$BV$125,\"<=\" & 'Prosjektbeskrivelse og inndata'!$C$14,O248:BL248)","v":0},0,0,0,0,0,0,0,0,0,0,0,0,0,0,0,0,0,0,0,0,0,0,0,0,0,0,0,0,0,0,0,0,0,0,0,0,0,0,0,0,0,0,0,0,0,0,0,0,0,0,0,0,0,0,0,0,0,0,0,0]
[null,null,null,"Feiing elektrisk/hydrogen",{"$f":"C240*'Drift og vedlikehold'!G26*Beregningsfaktorer!D79","v":0},"kWh",1,"Drift","Elektrisitet",{"$f":"Utslippsfaktorer!B24","v":"Elektrisitet 55 år, europeisk miks"},{"$f":"SUMIF(Utslippsfaktorer!B:B,Beregninger!J249,Utslippsfaktorer!D:D)","v":0.13600000000000001},{"$f":"VLOOKUP(J249,Utslippsfaktorer!B:C,2,FALSE)","v":"kg CO2e/kWh"},0,{"$f":"SUMIF($O$125:$BV$125,\"<=\" & 'Prosjektbeskrivelse og inndata'!$C$14,O249:BL249)","v":0},0,0,0,0,0,0,0,0,0,0,0,0,0,0,0,0,0,0,0,0,0,0,0,0,0,0,0,0,0,0,0,0,0,0,0,0,0,0,0,0,0,0,0,0,0,0,0,0,0,0,0,0,0,0,0,0,0,0,0,0]
[null,null,null,"Salting diesel",{"$f":"C240*'Drift og vedlikehold'!E27*(Beregningsfaktorer!D79/2)","v":0},"liter diesel",1,"Drift","Diesel",{"$f":"Utslippsfaktorer!B20","v":"Fossil diesel (WTW)"},{"$f":"SUMIF(Utslippsfaktorer!B:B,Beregninger!J250,Utslippsfaktorer!D:D)","v":3.24},{"$f":"VLOOKUP(J250,Utslippsfaktorer!B:C,2,FALSE)","v":"kg CO2e/liter"},0,{"$f":"SUMIF($O$125:$BV$125,\"<=\" & 'Prosjektbeskrivelse og inndata'!$C$14,O250:BL250)","v":0},0,0,0,0,0,0,0,0,0,0,0,0,0,0,0,0,0,0,0,0,0,0,0,0,0,0,0,0,0,0,0,0,0,0,0,0,0,0,0,0,0,0,0,0,0,0,0,0,0,0,0,0,0,0,0,0,0,0,0,0]
[null,null,null,"Salting biodiesel",{"$f":"C240*'Drift og vedlikehold'!F27*(Beregningsfaktorer!D79/2)","v":0},"liter biodiesel",1,"Drift","Biodiesel",{"$f":"Utslippsfaktorer!B18","v":"Biodiesel (WTT)"},{"$f":"SUMIF(Utslippsfaktorer!B:B,Beregninger!J251,Utslippsfaktorer!D:D)","v":1.92},{"$f":"VLOOKUP(J251,Utslippsfaktorer!B:C,2,FALSE)","v":"kg CO2e/liter"},0,{"$f":"SUMIF($O$125:$BV$125,\"<=\" & 'Prosjektbeskrivelse og inndata'!$C$14,O251:BL251)","v":0},0,0,0,0,0,0,0,0,0,0,0,0,0,0,0,0,0,0,0,0,0,0,0,0,0,0,0,0,0,0,0,0,0,0,0,0,0,0,0,0,0,0,0,0,0,0,0,0,0,0,0,0,0,0,0,0,0,0,0,0]
[null,null,null,"Salting elektrisk/hydrogen",{"$f":"C240*'Drift og vedlikehold'!G27*(Beregningsfaktorer!D79/2)","v":0},"kWh",1,"Drift","Elektrisitet",{"$f":"Utslippsfaktorer!B24","v":"Elektrisitet 55 år, europeisk miks"},{"$f":"SUMIF(Utslippsfaktorer!B:B,Beregninger!J252,Utslippsfaktorer!D:D)","v":0.13600000000000001},{"$f":"VLOOKUP(J252,Utslippsfaktorer!B:C,2,FALSE)","v":"kg CO2e/kWh"},0,{"$f":"SUMIF($O$125:$BV$125,\"<=\" & 'Prosjektbeskrivelse og inndata'!$C$14,O252:BL252)","v":0},0,0,0,0,0,0,0,0,0,0,0,0,0,0,0,0,0,0,0,0,0,0,0,0,0,0,0,0,0,0,0,0,0,0,0,0,0,0,0,0,0,0,0,0,0,0,0,0,0,0,0,0,0,0,0,0,0,0,0,0]
[null,null,null,"Salt",{"$f":"C240*'Drift og vedlikehold'!E16","v":0},"kg salt",1,"Drift","Salt",{"$f":"Utslippsfaktorer!B12","v":"Salt"},{"$f":"SUMIF(Utslippsfaktorer!B:B,Beregninger!J253,Utslippsfaktorer!D:D)","v":0.17899999999999999},{"$f":"VLOOKUP(J253,Utslippsfaktorer!B:C,2,FALSE)","v":"kg CO2e/kg"},0,{"$f":"SUMIF($O$125:$BV$125,\"<=\" & 'Prosjektbeskrivelse og inndata'!$C$14,O253:BL253)","v":0},0,0,0,0,0,0,0,0,0,0,0,0,0,0,0,0,0,0,0,0,0,0,0,0,0,0,0,0,0,0,0,0,0,0,0,0,0,0,0,0,0,0,0,0,0,0,0,0,0,0,0,0,0,0,0,0,0,0,0,0]
[null,null,null,"Salttransport diesel",{"$f":"C240*'Drift og vedlikehold'!F16","v":0},"liter diesel",1,"Drift","Diesel",{"$f":"Utslippsfaktorer!B20","v":"Fossil diesel (WTW)"},{"$f":"SUMIF(Utslippsfaktorer!B:B,Beregninger!J254,Utslippsfaktorer!D:D)","v":3.24},{"$f":"VLOOKUP(J254,Utslippsfaktorer!B:C,2,FALSE)","v":"kg CO2e/liter"},0,{"$f":"SUMIF($O$125:$BV$125,\"<=\" & 'Prosjektbeskrivelse og inndata'!$C$14,O254:BL254)","v":0},0,0,0,0,0,0,0,0,0,0,0,0,0,0,0,0,0,0,0,0,0,0,0,0,0,0,0,0,0,0,0,0,0,0,0,0,0,0,0,0,0,0,0,0,0,0,0,0,0,0,0,0,0,0,0,0,0,0,0,0]
[null,null,null,"Salttransport biodiesel",{"$f":"C240*'Drift og vedlikehold'!G16","v":0},"liter biodiesel",1,"Drift","Biodiesel",{"$f":"Utslippsfaktorer!B18","v":"Biodiesel (WTT)"},{"$f":"SUMIF(Utslippsfaktorer!B:B,Beregninger!J255,Utslippsfaktorer!D:D)","v":1.92},{"$f":"VLOOKUP(J255,Utslippsfaktorer!B:C,2,FALSE)","v":"kg CO2e/liter"},0,{"$f":"SUMIF($O$125:$BV$125,\"<=\" & 'Prosjektbeskrivelse og inndata'!$C$14,O255:BL255)","v":0},0,0,0,0,0,0,0,0,0,0,0,0,0,0,0,0,0,0,0,0,0,0,0,0,0,0,0,0,0,0,0,0,0,0,0,0,0,0,0,0,0,0,0,0,0,0,0,0,0,0,0,0,0,0,0,0,0,0,0,0]
[null,null,null,"Salttransport elektrisk/hydrogen",{"$f":"C240*'Drift og vedlikehold'!H16","v":0},"kWh",1,"Drift","Elektrisitet",{"$f":"Utslippsfaktorer!B24","v":"Elektrisitet 55 år, europeisk miks"},{"$f":"SUMIF(Utslippsfaktorer!B:B,Beregninger!J256,Utslippsfaktorer!D:D)","v":0.13600000000000001},{"$f":"VLOOKUP(J256,Utslippsfaktorer!B:C,2,FALSE)","v":"kg CO2e/kWh"},0,{"$f":"SUMIF($O$125:$BV$125,\"<=\" & 'Prosjektbeskrivelse og inndata'!$C$14,O256:BL256)","v":0},{"$f":"IF(MOD(O$125,$G256)=0,$M256,\"\")","v":0},0,0,0,0,0,0,0,0,0,{"$f":"IF(MOD(Y$125,$G256)=0,$M256,\"\")","v":0},0,0,0,0,0,0,0,0,0,{"$f":"IF(MOD(AI$125,$G256)=0,$M256,\"\")","v":0},0,0,0,0,0,0,0,0,0,{"$f":"IF(MOD(AS$125,$G256)=0,$M256,\"\")","v":0},0,0,0,0,0,0,0,0,0,{"$f":"IF(MOD(BC$125,$G256)=0,$M256,\"\")","v":0},0,0,0,0,0,0,0,0,0,{"$f":"IF(MOD(BM$125,$G256)=0,$M256,\"\")","v":0},0,0,0,0,0,0,0,0,0]
[null,null,null,"Brøyting diesel",{"$f":"C240*'Drift og vedlikehold'!E28","v":0},"liter diesel",1,"Drift","Diesel",{"$f":"Utslippsfaktorer!B20","v":"Fossil diesel (WTW)"},{"$f":"SUMIF(Utslippsfaktorer!B:B,Beregninger!J257,Utslippsfaktorer!D:D)","v":3.24},{"$f":"VLOOKUP(J257,Utslippsfaktorer!B:C,2,FALSE)","v":"kg CO2e/liter"},0,{"$f":"SUMIF($O$125:$BV$125,\"<=\" & 'Prosjektbeskrivelse og inndata'!$C$14,O257:BL257)","v":0},0,0,0,0,0,0,0,0,0,0,0,0,0,0,0,0,0,0,0,0,0,0,0,0,0,0,0,0,0,0,0,0,0,0,0,0,0,0,0,0,0,0,0,0,0,0,0,0,0,0,0,0,0,0,0,0,0,0,0,0]
[null,null,null,"Brøyting biodiesel",{"$f":"C240*'Drift og vedlikehold'!F28","v":0},"liter biodiesel",1,"Drift","Biodiesel",{"$f":"Utslippsfaktorer!B18","v":"Biodiesel (WTT)"},{"$f":"SUMIF(Utslippsfaktorer!B:B,Beregninger!J258,Utslippsfaktorer!D:D)","v":1.92},{"$f":"VLOOKUP(J258,Utslippsfaktorer!B:C,2,FALSE)","v":"kg CO2e/liter"},0,{"$f":"SUMIF($O$125:$BV$125,\"<=\" & 'Prosjektbeskrivelse og inndata'!$C$14,O258:BL258)","v":0},0,0,0,0,0,0,0,0,0,0,0,0,0,0,0,0,0,0,0,0,0,0,0,0,0,0,0,0,0,0,0,0,0,0,0,0,0,0,0,0,0,0,0,0,0,0,0,0,0,0,0,0,0,0,0,0,0,0,0,0]
[null,null,null,"Brøyting elektrisk/hydrogen",{"$f":"C240*'Drift og vedlikehold'!G28","v":0},"kWh",1,"Drift","Elektrisitet",{"$f":"Utslippsfaktorer!B24","v":"Elektrisitet 55 år, europeisk miks"},{"$f":"SUMIF(Utslippsfaktorer!B:B,Beregninger!J259,Utslippsfaktorer!D:D)","v":0.13600000000000001},{"$f":"VLOOKUP(J259,Utslippsfaktorer!B:C,2,FALSE)","v":"kg CO2e/kWh"},0,{"$f":"SUMIF($O$125:$BV$125,\"<=\" & 'Prosjektbeskrivelse og inndata'!$C$14,O259:BL259)","v":0},0,0,0,0,0,0,0,0,0,0,0,0,0,0,0,0,0,0,0,0,0,0,0,0,0,0,0,0,0,0,0,0,0,0,0,0,0,0,0,0,0,0,0,0,0,0,0,0,0,0,0,0,0,0,0,0,0,0,0,0]
[null,null,null,"Autovern",{"$f":"C240*'Tillegg vei'!D7*Beregningsfaktorer!D83","v":0},"kg stål",{"$f":"Beregningsfaktorer!D51","v":30},"Vedlikehold","Stål",{"$f":"Utslippsfaktorer!B14","v":"Stål"},{"$f":"SUMIF(Utslippsfaktorer!B:B,Beregninger!J260,Utslippsfaktorer!D:D)","v":2.1234999999999999},{"$f":"VLOOKUP(J260,Utslippsfaktorer!B:C,2,FALSE)","v":"kg CO2e/kg"},0,{"$f":"SUMIF($O$125:$BV$125,\"<=\" & 'Prosjektbeskrivelse og inndata'!$C$14,O260:BL260)","v":0},"","","","","","","","","","","","","","","","","","","","","","","","","","","","","",0,"","","","","","","","","","","","","","","","","","","","","","","","","","","","","",0]
[null,null,null,"Utskiftning autovern diesel",{"$f":"C240*'Tillegg vei'!E7*Beregningsfaktorer!D83","v":0},"liter diesel",{"$f":"Beregningsfaktorer!D51","v":30},"Vedlikehold","Diesel",{"$f":"Utslippsfaktorer!B20","v":"Fossil diesel (WTW)"},{"$f":"SUMIF(Utslippsfaktorer!B:B,Beregninger!J261,Utslippsfaktorer!D:D)","v":3.24},{"$f":"VLOOKUP(J261,Utslippsfaktorer!B:C,2,FALSE)","v":"kg CO2e/liter"},0,{"$f":"SUMIF($O$125:$BV$125,\"<=\" & 'Prosjektbeskrivelse og inndata'!$C$14,O261:BL261)","v":0},"","","","","","","","","","","","","","","","","","","","","","","","","","","","","",0,"","","","","","","","","","","","","","","","","","","","","","","","","","","","","",0]
[null,null,null,"Utskiftning autovern biodiesel",{"$f":"C240*'Tillegg vei'!F7*Beregningsfaktorer!D83","v":0},"liter biodiesel",{"$f":"Beregningsfaktorer!D51","v":30},"Vedlikehold","Biodiesel",{"$f":"Utslippsfaktorer!B18","v":"Biodiesel (WTT)"},{"$f":"SUMIF(Utslippsfaktorer!B:B,Beregninger!J262,Utslippsfaktorer!D:D)","v":1.92},{"$f":"VLOOKUP(J262,Utslippsfaktorer!B:C,2,FALSE)","v":"kg CO2e/liter"},0,{"$f":"SUMIF($O$125:$BV$125,\"<=\" & 'Prosjektbeskrivelse og inndata'!$C$14,O262:BL262)","v":0},"","","","","","","","","","","","","","","","","","","","","","","","","","","","","",0,"","","","","","","","","","","","","","","","","","","","","","","","","","","","","",0]
[null,null,null,"Utskiftning autovern elektrisk/hydrogen",{"$f":"C240*'Tillegg vei'!G7*Beregningsfaktorer!D83","v":0},"kWh",{"$f":"Beregningsfaktorer!D51","v":30},"Vedlikehold","Elektrisitet",{"$f":"Utslippsfaktorer!B24","v":"Elektrisitet 55 år, europeisk miks"},{"$f":"SUMIF(Utslippsfaktorer!B:B,Beregninger!J263,Utslippsfaktorer!D:D)","v":0.13600000000000001},{"$f":"VLOOKUP(J263,Utslippsfaktorer!B:C,2,FALSE)","v":"kg CO2e/kWh"},0,{"$f":"SUMIF($O$125:$BV$125,\"<=\" & 'Prosjektbeskrivelse og inndata'!$C$14,O263:BL263)","v":0},"","","","","","","","","","","","","","","","","","","","","","","","","","","","","",0,"","","","","","","","","","","","","","","","","","","","","","","","","","","","","",0]
[null,null,null,"Transport av autovern diesel",{"$f":"C240*'Drift og vedlikehold'!F19*Beregningsfaktorer!D83","v":0},"liter diesel",{"$f":"Beregningsfaktorer!D51","v":30},"Vedlikehold","Diesel",{"$f":"Utslippsfaktorer!B20","v":"Fossil diesel (WTW)"},{"$f":"SUMIF(Utslippsfaktorer!B:B,Beregninger!J264,Utslippsfaktorer!D:D)","v":3.24},{"$f":"VLOOKUP(J264,Utslippsfaktorer!B:C,2,FALSE)","v":"kg CO2e/liter"},0,{"$f":"SUMIF($O$125:$BV$125,\"<=\" & 'Prosjektbeskrivelse og inndata'!$C$14,O264:BL264)","v":0},"","","","","","","","","","","","","","","","","","","","","","","","","","","","","",0,"","","","","","","","","","","","","","","","","","","","","","","","","","","","","",0]
[null,null,null,"Transport av autovern biodiesel",{"$f":"C240*'Drift og vedlikehold'!G19*Beregningsfaktorer!D83","v":0},"liter biodiesel",{"$f":"Beregningsfaktorer!D51","v":30},"Vedlikehold","Biodiesel",{"$f":"Utslippsfaktorer!B18","v":"Biodiesel (WTT)"},{"$f":"SUMIF(Utslippsfaktorer!B:B,Beregninger!J265,Utslippsfaktorer!D:D)","v":1.92},{"$f":"VLOOKUP(J265,Utslippsfaktorer!B:C,2,FALSE)","v":"kg CO2e/liter"},0,{"$f":"SUMIF($O$125:$BV$125,\"<=\" & 'Prosjektbeskrivelse og inndata'!$C$14,O265:BL265)","v":0},"","","","","","","","","","","","","","","","","","","","","","","","","","","","","",0,"","","","","","","","","","","","","","","","","","","","","","","","","","","","","",0]
[null,null,null,"Transport av autovern elektrisk/hydrogen",{"$f":"C240*'Drift og vedlikehold'!H19*Beregningsfaktorer!D83","v":0},"kWh",{"$f":"Beregningsfaktorer!D51","v":30},"Vedlikehold","Elektrisitet",{"$f":"Utslippsfaktorer!B24","v":"Elektrisitet 55 år, europeisk miks"},{"$f":"SUMIF(Utslippsfaktorer!B:B,Beregninger!J266,Utslippsfaktorer!D:D)","v":0.13600000000000001},{"$f":"VLOOKUP(J266,Utslippsfaktorer!B:C,2,FALSE)","v":"kg CO2e/kWh"},0,{"$f":"SUMIF($O$125:$BV$125,\"<=\" & 'Prosjektbeskrivelse og inndata'!$C$14,O266:BL266)","v":0},{"$f":"IF(MOD(O$125,$G266)=0,$M266,\"\")","v":""},"","","","","","","","","",{"$f":"IF(MOD(Y$125,$G266)=0,$M266,\"\")","v":""},"","","","","","","","","",{"$f":"IF(MOD(AI$125,$G266)=0,$M266,\"\")","v":""},"","","","","","","","",0,{"$f":"IF(MOD(AS$125,$G266)=0,$M266,\"\")","v":""},"","","","","","","","","",{"$f":"IF(MOD(BC$125,$G266)=0,$M266,\"\")","v":""},"","","","","","","","","",{"$f":"IF(MOD(BM$125,$G266)=0,$M266,\"\")","v":""},"","","","","","","","",0]
[null,null,null,"Lyktestolper",{"$f":"C240*'Tillegg vei'!D5*Beregningsfaktorer!D81","v":0},"kg stål",{"$f":"Beregningsfaktorer!D52","v":30},"Vedlikehold","Stål",{"$f":"Utslippsfaktorer!B14","v":"Stål"},{"$f":"SUMIF(Utslippsfaktorer!B:B,Beregninger!J267,Utslippsfaktorer!D:D)","v":2.1234999999999999},{"$f":"VLOOKUP(J267,Utslippsfaktorer!B:C,2,FALSE)","v":"kg CO2e/kg"},0,{"$f":"SUMIF($O$125:$BV$125,\"<=\" & 'Prosjektbeskrivelse og inndata'!$C$14,O267:BL267)","v":0},"","","","","","","","","","","","","","","","","","","","","","","","","","","","","",0,"","","","","","","","","","","","","","","","","","","","","","","","","","","","","",0]
[null,null,null,"Transport av lyktestolper diesel",{"$f":"C240*'Drift og vedlikehold'!F17*Beregningsfaktorer!D81","v":0},"liter diesel",{"$f":"Beregningsfaktorer!D52","v":30},"Vedlikehold","Diesel",{"$f":"Utslippsfaktorer!B20","v":"Fossil diesel (WTW)"},{"$f":"SUMIF(Utslippsfaktorer!B:B,Beregninger!J268,Utslippsfaktorer!D:D)","v":3.24},{"$f":"VLOOKUP(J268,Utslippsfaktorer!B:C,2,FALSE)","v":"kg CO2e/liter"},0,{"$f":"SUMIF($O$125:$BV$125,\"<=\" & 'Prosjektbeskrivelse og inndata'!$C$14,O268:BL268)","v":0},"","","","","","","","","","","","","","","","","","","","","","","","","","","","","",0,"","","","","","","","","","","","","","","","","","","","","","","","","","","","","",0]
[null,null,null,"Transport av lyktestolper biodiesel",{"$f":"C240*'Drift og vedlikehold'!G17*Beregningsfaktorer!D81","v":0},"liter biodiesel",{"$f":"Beregningsfaktorer!D52","v":30},"Vedlikehold","Biodiesel",{"$f":"Utslippsfaktorer!B18","v":"Biodiesel (WTT)"},{"$f":"SUMIF(Utslippsfaktorer!B:B,Beregninger!J269,Utslippsfaktorer!D:D)","v":1.92},{"$f":"VLOOKUP(J269,Utslippsfaktorer!B:C,2,FALSE)","v":"kg CO2e/liter"},0,{"$f":"SUMIF($O$125:$BV$125,\"<=\" & 'Prosjektbeskrivelse og inndata'!$C$14,O269:BL269)","v":0},"","","","","","","","","","","","","","","","","","","","","","","","","","","","","",0,"","","","","","","","","","","","","","","","","","","","","","","","","","","","","",0]
[null,null,null,"Transport av lyktestolper elektrisk/hydrogen",{"$f":"C240*'Drift og vedlikehold'!H17*Beregningsfaktorer!D81","v":0},"kWh",{"$f":"Beregningsfaktorer!D52","v":30},"Vedlikehold","Elektrisitet",{"$f":"Utslippsfaktorer!B24","v":"Elektrisitet 55 år, europeisk miks"},{"$f":"SUMIF(Utslippsfaktorer!B:B,Beregninger!J270,Utslippsfaktorer!D:D)","v":0.13600000000000001},{"$f":"VLOOKUP(J270,Utslippsfaktorer!B:C,2,FALSE)","v":"kg CO2e/kWh"},0,{"$f":"SUMIF($O$125:$BV$125,\"<=\" & 'Prosjektbeskrivelse og inndata'!$C$14,O270:BL270)","v":0},"","","","","","","","","","","","","","","","","","","","","","","","","","","","","",0,"","","","","","","","","","","","","","","","","","","","","","","","","","","","","",0]
[null,null,null,"Belysning vei i dagen",{"$f":"C240*'Drift og vedlikehold'!H8*Beregningsfaktorer!D81","v":0},"kWh",1,"Drift","Elektrisitet",{"$f":"Utslippsfaktorer!B24","v":"Elektrisitet 55 år, europeisk miks"},{"$f":"SUMIF(Utslippsfaktorer!B:B,Beregninger!J271,Utslippsfaktorer!D:D)","v":0.13600000000000001},{"$f":"VLOOKUP(J271,Utslippsfaktorer!B:C,2,FALSE)","v":"kg CO2e/kWh"},0,{"$f":"SUMIF($O$125:$BV$125,\"<=\" & 'Prosjektbeskrivelse og inndata'!$C$14,O271:BL271)","v":0},0,0,0,0,0,0,0,0,0,0,0,0,0,0,0,0,0,0,0,0,0,0,0,0,0,0,0,0,0,0,0,0,0,0,0,0,0,0,0,0,0,0,0,0,0,0,0,0,0,0,0,0,0,0,0,0,0,0,0,0]
[null,"Drift tunnel enkeltløp (m)",{"$f":"SUMIF('Prosjektbeskrivelse og inndata'!$M:$M,B88,'Prosjektbeskrivelse og inndata'!$L:$L)","v":0},"Asfalt til reasfaltering",{"$f":"C272*'Tunnel enkeltløp'!F14*Reasfaltering!C3","v":0},"kg skjelettasfalt",{"$f":"Beregningsfaktorer!D50","v":7},"Reasfaltering","Asfalt",{"$f":"Utslippsfaktorer!B7","v":"Skjelettasfalt (Ska)"},{"$f":"SUMIF(Utslippsfaktorer!B:B,Beregninger!J272,Utslippsfaktorer!D:D)","v":6.5699999999999995E-2},{"$f":"VLOOKUP(J272,Utslippsfaktorer!B:C,2,FALSE)","v":"kg CO2e/kg"},0,{"$f":"SUMIF($O$125:$BV$125,\"<=\" & 'Prosjektbeskrivelse og inndata'!$C$14,O272:BL272)","v":0},"","","","","","",0,"","","","","","",0,"","","","","","",0,"","","","","","",0,"","","","","","",0,"","","","","","",0,"","","","","","",0,"","","","","","",0,"","","",""]
[null,null,null,"Transport av asfalt diesel",{"$f":"C272*'Tunnel enkeltløp'!H14*Reasfaltering!C3","v":0},"liter diesel",{"$f":"Beregningsfaktorer!D50","v":7},"Reasfaltering","Diesel",{"$f":"Utslippsfaktorer!B20","v":"Fossil diesel (WTW)"},{"$f":"SUMIF(Utslippsfaktorer!B:B,Beregninger!J273,Utslippsfaktorer!D:D)","v":3.24},{"$f":"VLOOKUP(J273,Utslippsfaktorer!B:C,2,FALSE)","v":"kg CO2e/liter"},0,{"$f":"SUMIF($O$125:$BV$125,\"<=\" & 'Prosjektbeskrivelse og inndata'!$C$14,O273:BL273)","v":0},"","","","","","",0,"","","","","","",0,"","","","","","",0,"","","","","","",0,"","","","","","",0,"","","","","","",0,"","","","","","",0,"","","","","","",0,"","","",""]
[null,null,null,"Transport av asfalt biodiesel",{"$f":"C272*'Tunnel enkeltløp'!I14*Reasfaltering!C3","v":0},"liter biodiesel",{"$f":"Beregningsfaktorer!D50","v":7},"Reasfaltering","Biodiesel",{"$f":"Utslippsfaktorer!B18","v":"Biodiesel (WTT)"},{"$f":"SUMIF(Utslippsfaktorer!B:B,Beregninger!J274,Utslippsfaktorer!D:D)","v":1.92},{"$f":"VLOOKUP(J274,Utslippsfaktorer!B:C,2,FALSE)","v":"kg CO2e/liter"},0,{"$f":"SUMIF($O$125:$BV$125,\"<=\" & 'Prosjektbeskrivelse og inndata'!$C$14,O274:BL274)","v":0},"","","","","","",0,"","","","","","",0,"","","","","","",0,"","","","","","",0,"","","","","","",0,"","","","","","",0,"","","","","","",0,"","","","","","",0,"","","",""]
[null,null,null,"Transport av asfalt elektrisk/hydrogen",{"$f":"C272*'Tunnel enkeltløp'!J14*Reasfaltering!C3","v":0},"kWh",{"$f":"Beregningsfaktorer!D50","v":7},"Reasfaltering","Elektrisitet",{"$f":"Utslippsfaktorer!B24","v":"Elektrisitet 55 år, europeisk miks"},{"$f":"SUMIF(Utslippsfaktorer!B:B,Beregninger!J275,Utslippsfaktorer!D:D)","v":0.13600000000000001},{"$f":"VLOOKUP(J275,Utslippsfaktorer!B:C,2,FALSE)","v":"kg CO2e/kWh"},0,{"$f":"SUMIF($O$125:$BV$125,\"<=\" & 'Prosjektbeskrivelse og inndata'!$C$14,O275:BL275)","v":0},"","","","","","",0,"","","","","","",0,"","","","","","",0,"","","","","","",0,"","","","","","",0,"","","","","","",0,"","","","","","",0,"","","","","","",0,"","","",""]
[null,null,null,"Reasfaltering diesel",{"$f":"C272*'Tunnel enkeltløp'!H14*Reasfaltering!C3","v":0},"liter diesel",{"$f":"Beregningsfaktorer!D50","v":7},"Reasfaltering","Diesel",{"$f":"Utslippsfaktorer!B20","v":"Fossil diesel (WTW)"},{"$f":"SUMIF(Utslippsfaktorer!B:B,Beregninger!J276,Utslippsfaktorer!D:D)","v":3.24},{"$f":"VLOOKUP(J276,Utslippsfaktorer!B:C,2,FALSE)","v":"kg CO2e/liter"},0,{"$f":"SUMIF($O$125:$BV$125,\"<=\" & 'Prosjektbeskrivelse og inndata'!$C$14,O276:BL276)","v":0},{"$f":"IF(MOD(O$125,$G276)=0,$M276,\"\")","v":""},"","","","","",0,"","","",{"$f":"IF(MOD(Y$125,$G276)=0,$M276,\"\")","v":""},"","",0,"","","","","","",{"$f":"IF(MOD(AI$125,$G276)=0,$M276,\"\")","v":0},"","","","","","",0,"","",{"$f":"IF(MOD(AS$125,$G276)=0,$M276,\"\")","v":""},"","","",0,"","","","","",{"$f":"IF(MOD(BC$125,$G276)=0,$M276,\"\")","v":""},0,"","","","","","",0,"",{"$f":"IF(MOD(BM$125,$G276)=0,$M276,\"\")","v":""},"","","","",0,"","","",""]
[null,null,null,"Reasfaltering biodiesel",{"$f":"C272*'Tunnel enkeltløp'!I14*Reasfaltering!C3","v":0},"liter biodiesel",{"$f":"Beregningsfaktorer!D50","v":7},"Reasfaltering","Biodiesel",{"$f":"Utslippsfaktorer!B18","v":"Biodiesel (WTT)"},{"$f":"SUMIF(Utslippsfaktorer!B:B,Beregninger!J277,Utslippsfaktorer!D:D)","v":1.92},{"$f":"VLOOKUP(J277,Utslippsfaktorer!B:C,2,FALSE)","v":"kg CO2e/liter"},0,{"$f":"SUMIF($O$125:$BV$125,\"<=\" & 'Prosjektbeskrivelse og inndata'!$C$14,O277:BL277)","v":0},"","","","","","",0,"","","","","","",0,"","","","","","",0,"","","","","","",0,"","","","","","",0,"","","","","","",0,"","","","","","",0,"","","","","","",0,"","","",""]
[null,null,null,"Reasfaltering elektrisk/hydrogen",{"$f":"C272*'Tunnel enkeltløp'!J14*Reasfaltering!C3","v":0},"kWh",{"$f":"Beregningsfaktorer!D50","v":7},"Reasfaltering","Elektrisitet",{"$f":"Utslippsfaktorer!B24","v":"Elektrisitet 55 år, europeisk miks"},{"$f":"SUMIF(Utslippsfaktorer!B:B,Beregninger!J278,Utslippsfaktorer!D:D)","v":0.13600000000000001},{"$f":"VLOOKUP(J278,Utslippsfaktorer!B:C,2,FALSE)","v":"kg CO2e/kWh"},0,{"$f":"SUMIF($O$125:$BV$125,\"<=\" & 'Prosjektbeskrivelse og inndata'!$C$14,O278:BL278)","v":0},"","","","","","",0,"","","","","","",0,"","","","","","",0,"","","","","","",0,"","","","","","",0,"","","","","","",0,"","","","","","",0,"","","","","","",0,"","","",""]
[null,null,null,"Feiing diesel",{"$f":"C272*'Drift og vedlikehold'!E26*Beregningsfaktorer!D77","v":0},"liter diesel",1,"Drift","Diesel",{"$f":"Utslippsfaktorer!B20","v":"Fossil diesel (WTW)"},{"$f":"SUMIF(Utslippsfaktorer!B:B,Beregninger!J279,Utslippsfaktorer!D:D)","v":3.24},{"$f":"VLOOKUP(J279,Utslippsfaktorer!B:C,2,FALSE)","v":"kg CO2e/liter"},{"$f":"(E279*K279)/1000","v":0},{"$f":"SUMIF($O$125:$BV$125,\"<=\" & 'Prosjektbeskrivelse og inndata'!$C$14,O279:BL279)","v":0},0,0,0,0,0,0,0,0,0,0,0,0,0,0,0,0,0,0,0,0,0,0,0,0,0,0,0,0,0,0,0,0,0,0,0,0,0,0,0,0,0,0,0,0,0,0,0,0,0,0,0,0,0,0,0,0,0,0,0,0]
[null,null,null,"Feiing biodiesel",{"$f":"C272*'Drift og vedlikehold'!F26*Beregningsfaktorer!D77","v":0},"liter biodiesel",1,"Drift","Biodiesel",{"$f":"Utslippsfaktorer!B18","v":"Biodiesel (WTT)"},{"$f":"SUMIF(Utslippsfaktorer!B:B,Beregninger!J280,Utslippsfaktorer!D:D)","v":1.92},{"$f":"VLOOKUP(J280,Utslippsfaktorer!B:C,2,FALSE)","v":"kg CO2e/liter"},0,{"$f":"SUMIF($O$125:$BV$125,\"<=\" & 'Prosjektbeskrivelse og inndata'!$C$14,O280:BL280)","v":0},0,0,0,0,0,0,0,0,0,0,0,0,0,0,0,0,0,0,0,0,0,0,0,0,0,0,0,0,0,0,0,0,0,0,0,0,0,0,0,0,0,0,0,0,0,0,0,0,0,0,0,0,0,0,0,0,0,0,0,0]
[null,null,null,"Feiing elektrisk/hydrogen",{"$f":"C272*'Drift og vedlikehold'!G26*Beregningsfaktorer!D77","v":0},"kWh",1,"Drift","Elektrisitet",{"$f":"Utslippsfaktorer!B24","v":"Elektrisitet 55 år, europeisk miks"},{"$f":"SUMIF(Utslippsfaktorer!B:B,Beregninger!J281,Utslippsfaktorer!D:D)","v":0.13600000000000001},{"$f":"VLOOKUP(J281,Utslippsfaktorer!B:C,2,FALSE)","v":"kg CO2e/kWh"},0,{"$f":"SUMIF($O$125:$BV$125,\"<=\" & 'Prosjektbeskrivelse og inndata'!$C$14,O281:BL281)","v":0},0,0,0,0,0,0,0,0,0,0,0,0,0,0,0,0,0,0,0,0,0,0,0,0,0,0,0,0,0,0,0,0,0,0,0,0,0,0,0,0,0,0,0,0,0,0,0,0,0,0,0,0,0,0,0,0,0,0,0,0]
[null,null,null,"Autovern",{"$f":"C272*'Tillegg vei'!D7*Beregningsfaktorer!D83","v":0},"kg stål",{"$f":"Beregningsfaktorer!D51","v":30},"Vedlikehold","Stål",{"$f":"Utslippsfaktorer!B14","v":"Stål"},{"$f":"SUMIF(Utslippsfaktorer!B:B,Beregninger!J282,Utslippsfaktorer!D:D)","v":2.1234999999999999},{"$f":"VLOOKUP(J282,Utslippsfaktorer!B:C,2,FALSE)","v":"kg CO2e/kg"},0,{"$f":"SUMIF($O$125:$BV$125,\"<=\" & 'Prosjektbeskrivelse og inndata'!$C$14,O282:BL282)","v":0},"","","","","","","","","","","","","","","","","","","","","","","","","","","","","",0,"","","","","","","","","","","","","","","","","","","","","","","","","","","","","",0]
[null,null,null,"Utskiftning autovern diesel",{"$f":"C272*'Tillegg vei'!E7*Beregningsfaktorer!D83","v":0},"liter diesel",{"$f":"Beregningsfaktorer!D51","v":30},"Vedlikehold","Diesel",{"$f":"Utslippsfaktorer!B20","v":"Fossil diesel (WTW)"},{"$f":"SUMIF(Utslippsfaktorer!B:B,Beregninger!J283,Utslippsfaktorer!D:D)","v":3.24},{"$f":"VLOOKUP(J283,Utslippsfaktorer!B:C,2,FALSE)","v":"kg CO2e/liter"},0,{"$f":"SUMIF($O$125:$BV$125,\"<=\" & 'Prosjektbeskrivelse og inndata'!$C$14,O283:BL283)","v":0},"","","","","","","","","","","","","","","","","","","","","","","","","","","","","",0,"","","","","","","","","","","","","","","","","","","","","","","","","","","","","",0]
[null,null,null,"Utskiftning autovern biodiesel",{"$f":"C272*'Tillegg vei'!F7*Beregningsfaktorer!D83","v":0},"liter biodiesel",{"$f":"Beregningsfaktorer!D51","v":30},"Vedlikehold","Biodiesel",{"$f":"Utslippsfaktorer!B18","v":"Biodiesel (WTT)"},{"$f":"SUMIF(Utslippsfaktorer!B:B,Beregninger!J284,Utslippsfaktorer!D:D)","v":1.92},{"$f":"VLOOKUP(J284,Utslippsfaktorer!B:C,2,FALSE)","v":"kg CO2e/liter"},0,{"$f":"SUMIF($O$125:$BV$125,\"<=\" & 'Prosjektbeskrivelse og inndata'!$C$14,O284:BL284)","v":0},"","","","","","","","","","","","","","","","","","","","","","","","","","","","","",0,"","","","","","","","","","","","","","","","","","","","","","","","","","","","","",0]
[null,null,null,"Utskiftning autovern elektrisk/hydrogen",{"$f":"C272*'Tillegg vei'!G7*Beregningsfaktorer!D83","v":0},"kWh",{"$f":"Beregningsfaktorer!D51","v":30},"Vedlikehold","Elektrisitet",{"$f":"Utslippsfaktorer!B24","v":"Elektrisitet 55 år, europeisk miks"},{"$f":"SUMIF(Utslippsfaktorer!B:B,Beregninger!J285,Utslippsfaktorer!D:D)","v":0.13600000000000001},{"$f":"VLOOKUP(J285,Utslippsfaktorer!B:C,2,FALSE)","v":"kg CO2e/kWh"},0,{"$f":"SUMIF($O$125:$BV$125,\"<=\" & 'Prosjektbeskrivelse og inndata'!$C$14,O285:BL285)","v":0},"","","","","","","","","","","","","","","","","","","","","","","","","","","","","",0,"","","","","","","","","","","","","","","","","","","","","","","","","","","","","",0]
[null,null,null,"Transport av autovern diesel",{"$f":"C272*'Drift og vedlikehold'!F19*Beregningsfaktorer!D83","v":0},"liter diesel",{"$f":"Beregningsfaktorer!D51","v":30},"Vedlikehold","Diesel",{"$f":"Utslippsfaktorer!B20","v":"Fossil diesel (WTW)"},{"$f":"SUMIF(Utslippsfaktorer!B:B,Beregninger!J286,Utslippsfaktorer!D:D)","v":3.24},{"$f":"VLOOKUP(J286,Utslippsfaktorer!B:C,2,FALSE)","v":"kg CO2e/liter"},0,{"$f":"SUMIF($O$125:$BV$125,\"<=\" & 'Prosjektbeskrivelse og inndata'!$C$14,O286:BL286)","v":0},{"$f":"IF(MOD(O$125,$G286)=0,$M286,\"\")","v":""},"","","","","","","","","",{"$f":"IF(MOD(Y$125,$G286)=0,$M286,\"\")","v":""},"","","","","","","","","",{"$f":"IF(MOD(AI$125,$G286)=0,$M286,\"\")","v":""},"","","","","","","","",0,{"$f":"IF(MOD(AS$125,$G286)=0,$M286,\"\")","v":""},"","","","","","","","","",{"$f":"IF(MOD(BC$125,$G286)=0,$M286,\"\")","v":""},"","","","","","","","","",{"$f":"IF(MOD(BM$125,$G286)=0,$M286,\"\")","v":""},"","","","","","","","",0]
[null,null,null,"Transport av autovern biodiesel",{"$f":"C272*'Drift og vedlikehold'!G19*Beregningsfaktorer!D83","v":0},"liter biodiesel",{"$f":"Beregningsfaktorer!D51","v":30},"Vedlikehold","Biodiesel",{"$f":"Utslippsfaktorer!B18","v":"Biodiesel (WTT)"},{"$f":"SUMIF(Utslippsfaktorer!B:B,Beregninger!J287,Utslippsfaktorer!D:D)","v":1.92},{"$f":"VLOOKUP(J287,Utslippsfaktorer!B:C,2,FALSE)","v":"kg CO2e/liter"},0,{"$f":"SUMIF($O$125:$BV$125,\"<=\" & 'Prosjektbeskrivelse og inndata'!$C$14,O287:BL287)","v":0},"","","","","","","","","","","","","","","","","","","","","","","","","","","","","",0,"","","","","","","","","","","","","","","","","","","","","","","","","","","","","",0]
[null,null,null,"Transport av autovern elektrisk/hydrogen",{"$f":"C272*'Drift og vedlikehold'!H19*Beregningsfaktorer!D83","v":0},"kWh",{"$f":"Beregningsfaktorer!D51","v":30},"Vedlikehold","Elektrisitet",{"$f":"Utslippsfaktorer!B24","v":"Elektrisitet 55 år, europeisk miks"},{"$f":"SUMIF(Utslippsfaktorer!B:B,Beregninger!J288,Utslippsfaktorer!D:D)","v":0.13600000000000001},{"$f":"VLOOKUP(J288,Utslippsfaktorer!B:C,2,FALSE)","v":"kg CO2e/kWh"},0,{"$f":"SUMIF($O$125:$BV$125,\"<=\" & 'Prosjektbeskrivelse og inndata'!$C$14,O288:BL288)","v":0},"","","","","","","","","","","","","","","","","","","","","","","","","","","","","",0,"","","","","","","","","","","","","","","","","","","","","","","","","","","","","",0]
[null,null,null,"Belysning tunnel",{"$f":"C272*'Drift og vedlikehold'!H10","v":0},"kWh",1,"Drift","Elektrisitet",{"$f":"Utslippsfaktorer!B24","v":"Elektrisitet 55 år, europeisk miks"},{"$f":"SUMIF(Utslippsfaktorer!B:B,Beregninger!J289,Utslippsfaktorer!D:D)","v":0.13600000000000001},{"$f":"VLOOKUP(J289,Utslippsfaktorer!B:C,2,FALSE)","v":"kg CO2e/kWh"},0,{"$f":"SUMIF($O$125:$BV$125,\"<=\" & 'Prosjektbeskrivelse og inndata'!$C$14,O289:BL289)","v":0},0,0,0,0,0,0,0,0,0,0,0,0,0,0,0,0,0,0,0,0,0,0,0,0,0,0,0,0,0,0,0,0,0,0,0,0,0,0,0,0,0,0,0,0,0,0,0,0,0,0,0,0,0,0,0,0,0,0,0,0]
[null,null,null,"Viftedrift tunnel",{"$f":"C272*'Drift og vedlikehold'!H13","v":0},"kWh",1,"Drift","Elektrisitet",{"$f":"Utslippsfaktorer!B24","v":"Elektrisitet 55 år, europeisk miks"},{"$f":"SUMIF(Utslippsfaktorer!B:B,Beregninger!J290,Utslippsfaktorer!D:D)","v":0.13600000000000001},{"$f":"VLOOKUP(J290,Utslippsfaktorer!B:C,2,FALSE)","v":"kg CO2e/kWh"},0,{"$f":"SUMIF($O$125:$BV$125,\"<=\" & 'Prosjektbeskrivelse og inndata'!$C$14,O290:BL290)","v":0},0,0,0,0,0,0,0,0,0,0,0,0,0,0,0,0,0,0,0,0,0,0,0,0,0,0,0,0,0,0,0,0,0,0,0,0,0,0,0,0,0,0,0,0,0,0,0,0,0,0,0,0,0,0,0,0,0,0,0,0]
[null,null,null,"Pumper tunnel",{"$f":"C272*'Drift og vedlikehold'!H11","v":0},"kWh",1,"Drift","Elektrisitet",{"$f":"Utslippsfaktorer!B24","v":"Elektrisitet 55 år, europeisk miks"},{"$f":"SUMIF(Utslippsfaktorer!B:B,Beregninger!J291,Utslippsfaktorer!D:D)","v":0.13600000000000001},{"$f":"VLOOKUP(J291,Utslippsfaktorer!B:C,2,FALSE)","v":"kg CO2e/kWh"},0,{"$f":"SUMIF($O$125:$BV$125,\"<=\" & 'Prosjektbeskrivelse og inndata'!$C$14,O291:BL291)","v":0},0,0,0,0,0,0,0,0,0,0,0,0,0,0,0,0,0,0,0,0,0,0,0,0,0,0,0,0,0,0,0,0,0,0,0,0,0,0,0,0,0,0,0,0,0,0,0,0,0,0,0,0,0,0,0,0,0,0,0,0]
[null,"Drift tunnel dobbeltløp (m)",{"$f":"SUMIF('Prosjektbeskrivelse og inndata'!$M:$M,B102,'Prosjektbeskrivelse og inndata'!$L:$L)","v":0},"Asfalt til reasfaltering",{"$f":"C292*2*'Tunnel dobbeltløp'!F14*Reasfaltering!C3","v":0},"kg skjelettasfalt",{"$f":"Beregningsfaktorer!D50","v":7},"Reasfaltering","Asfalt",{"$f":"Utslippsfaktorer!B7","v":"Skjelettasfalt (Ska)"},{"$f":"SUMIF(Utslippsfaktorer!B:B,Beregninger!J292,Utslippsfaktorer!D:D)","v":6.5699999999999995E-2},{"$f":"VLOOKUP(J292,Utslippsfaktorer!B:C,2,FALSE)","v":"kg CO2e/kg"},0,{"$f":"SUMIF($O$125:$BV$125,\"<=\" & 'Prosjektbeskrivelse og inndata'!$C$14,O292:BL292)","v":0},"","","","","","",0,"","","","","","",0,"","","","","","",0,"","","","","","",0,"","","","","","",0,"","","","","","",0,"","","","","","",0,"","","","","","",0,"","","",""]
[null,null,null,"Transport av asfalt diesel",{"$f":"C292*2*'Tunnel dobbeltløp'!H14*Reasfaltering!C3","v":0},"liter diesel",{"$f":"Beregningsfaktorer!D50","v":7},"Reasfaltering","Diesel",{"$f":"Utslippsfaktorer!B20","v":"Fossil diesel (WTW)"},{"$f":"SUMIF(Utslippsfaktorer!B:B,Beregninger!J293,Utslippsfaktorer!D:D)","v":3.24},{"$f":"VLOOKUP(J293,Utslippsfaktorer!B:C,2,FALSE)","v":"kg CO2e/liter"},0,{"$f":"SUMIF($O$125:$BV$125,\"<=\" & 'Prosjektbeskrivelse og inndata'!$C$14,O293:BL293)","v":0},"","","","","","",0,"","","","","","",0,"","","","","","",0,"","","","","","",0,"","","","","","",0,"","","","","","",0,"","","","","","",0,"","","","","","",0,"","","",""]
[null,null,null,"Transport av asfalt biodiesel",{"$f":"C292*2*'Tunnel dobbeltløp'!I14*Reasfaltering!C3","v":0},"liter biodiesel",{"$f":"Beregningsfaktorer!D50","v":7},"Reasfaltering","Biodiesel",{"$f":"Utslippsfaktorer!B18","v":"Biodiesel (WTT)"},{"$f":"SUMIF(Utslippsfaktorer!B:B,Beregninger!J294,Utslippsfaktorer!D:D)","v":1.92},{"$f":"VLOOKUP(J294,Utslippsfaktorer!B:C,2,FALSE)","v":"kg CO2e/liter"},0,{"$f":"SUMIF($O$125:$BV$125,\"<=\" & 'Prosjektbeskrivelse og inndata'!$C$14,O294:BL294)","v":0},"","","","","","",0,"","","","","","",0,"","","","","","",0,"","","","","","",0,"","","","","","",0,"","","","","","",0,"","","","","","",0,"","","","","","",0,"","","",""]
[null,null,null,"Transport av asfalt elektrisk/hydrogen",{"$f":"C292*2*'Tunnel dobbeltløp'!J14*Reasfaltering!C3","v":0},"kWh",{"$f":"Beregningsfaktorer!D50","v":7},"Reasfaltering","Elektrisitet",{"$f":"Utslippsfaktorer!B24","v":"Elektrisitet 55 år, europeisk miks"},{"$f":"SUMIF(Utslippsfaktorer!B:B,Beregninger!J295,Utslippsfaktorer!D:D)","v":0.13600000000000001},{"$f":"VLOOKUP(J295,Utslippsfaktorer!B:C,2,FALSE)","v":"kg CO2e/kWh"},0,{"$f":"SUMIF($O$125:$BV$125,\"<=\" & 'Prosjektbeskrivelse og inndata'!$C$14,O295:BL295)","v":0},"","","","","","",0,"","","","","","",0,"","","","","","",0,"","","","","","",0,"","","","","","",0,"","","","","","",0,"","","","","","",0,"","","","","","",0,"","","",""]
[null,null,null,"Reasfaltering diesel",{"$f":"C292*2*'Tunnel dobbeltløp'!H14*Reasfaltering!C3","v":0},"liter diesel",{"$f":"Beregningsfaktorer!D50","v":7},"Reasfaltering","Diesel",{"$f":"Utslippsfaktorer!B20","v":"Fossil diesel (WTW)"},{"$f":"SUMIF(Utslippsfaktorer!B:B,Beregninger!J296,Utslippsfaktorer!D:D)","v":3.24},{"$f":"VLOOKUP(J296,Utslippsfaktorer!B:C,2,FALSE)","v":"kg CO2e/liter"},0,{"$f":"SUMIF($O$125:$BV$125,\"<=\" & 'Prosjektbeskrivelse og inndata'!$C$14,O296:BL296)","v":0},{"$f":"IF(MOD(O$125,$G296)=0,$M296,\"\")","v":""},"","","","","",0,"","","",{"$f":"IF(MOD(Y$125,$G296)=0,$M296,\"\")","v":""},"","",0,"","","","","","",{"$f":"IF(MOD(AI$125,$G296)=0,$M296,\"\")","v":0},"","","","","","",0,"","",{"$f":"IF(MOD(AS$125,$G296)=0,$M296,\"\")","v":""},"","","",0,"","","","","",{"$f":"IF(MOD(BC$125,$G296)=0,$M296,\"\")","v":""},0,"","","","","","",0,"",{"$f":"IF(MOD(BM$125,$G296)=0,$M296,\"\")","v":""},"","","","",0,"","","",""]
[null,null,null,"Reasfaltering biodiesel",{"$f":"C292*2*'Tunnel dobbeltløp'!I14*Reasfaltering!C3","v":0},"liter biodiesel",{"$f":"Beregningsfaktorer!D50","v":7},"Reasfaltering","Biodiesel",{"$f":"Utslippsfaktorer!B18","v":"Biodiesel (WTT)"},{"$f":"SUMIF(Utslippsfaktorer!B:B,Beregninger!J297,Utslippsfaktorer!D:D)","v":1.92},{"$f":"VLOOKUP(J297,Utslippsfaktorer!B:C,2,FALSE)","v":"kg CO2e/liter"},0,{"$f":"SUMIF($O$125:$BV$125,\"<=\" & 'Prosjektbeskrivelse og inndata'!$C$14,O297:BL297)","v":0},"","","","","","",0,"","","","","","",0,"","","","","","",0,"","","","","","",0,"","","","","","",0,"","","","","","",0,"","","","","","",0,"","","","","","",0,"","","",""]
[null,null,null,"Reasfaltering elektrisk/hydrogen",{"$f":"C292*2*'Tunnel dobbeltløp'!J14*Reasfaltering!C3","v":0},"kWh",{"$f":"Beregningsfaktorer!D50","v":7},"Reasfaltering","Elektrisitet",{"$f":"Utslippsfaktorer!B24","v":"Elektrisitet 55 år, europeisk miks"},{"$f":"SUMIF(Utslippsfaktorer!B:B,Beregninger!J298,Utslippsfaktorer!D:D)","v":0.13600000000000001},{"$f":"VLOOKUP(J298,Utslippsfaktorer!B:C,2,FALSE)","v":"kg CO2e/kWh"},0,{"$f":"SUMIF($O$125:$BV$125,\"<=\" & 'Prosjektbeskrivelse og inndata'!$C$14,O298:BL298)","v":0},"","","","","","",0,"","","","","","",0,"","","","","","",0,"","","","","","",0,"","","","","","",0,"","","","","","",0,"","","","","","",0,"","","","","","",0,"","","",""]
[null,null,null,"Feiing diesel",{"$f":"C292*'Drift og vedlikehold'!E26*Beregningsfaktorer!D78","v":0},"liter diesel",1,"Drift","Diesel",{"$f":"Utslippsfaktorer!B20","v":"Fossil diesel (WTW)"},{"$f":"SUMIF(Utslippsfaktorer!B:B,Beregninger!J299,Utslippsfaktorer!D:D)","v":3.24},{"$f":"VLOOKUP(J299,Utslippsfaktorer!B:C,2,FALSE)","v":"kg CO2e/liter"},0,{"$f":"SUMIF($O$125:$BV$125,\"<=\" & 'Prosjektbeskrivelse og inndata'!$C$14,O299:BL299)","v":0},0,0,0,0,0,0,0,0,0,0,0,0,0,0,0,0,0,0,0,0,0,0,0,0,0,0,0,0,0,0,0,0,0,0,0,0,0,0,0,0,0,0,0,0,0,0,0,0,0,0,0,0,0,0,0,0,0,0,0,0]
[null,null,null,"Feiing biodiesel",{"$f":"C292*'Drift og vedlikehold'!F26*Beregningsfaktorer!D78","v":0},"liter biodiesel",1,"Drift","Biodiesel",{"$f":"Utslippsfaktorer!B18","v":"Biodiesel (WTT)"},{"$f":"SUMIF(Utslippsfaktorer!B:B,Beregninger!J300,Utslippsfaktorer!D:D)","v":1.92},{"$f":"VLOOKUP(J300,Utslippsfaktorer!B:C,2,FALSE)","v":"kg CO2e/liter"},0,{"$f":"SUMIF($O$125:$BV$125,\"<=\" & 'Prosjektbeskrivelse og inndata'!$C$14,O300:BL300)","v":0},0,0,0,0,0,0,0,0,0,0,0,0,0,0,0,0,0,0,0,0,0,0,0,0,0,0,0,0,0,0,0,0,0,0,0,0,0,0,0,0,0,0,0,0,0,0,0,0,0,0,0,0,0,0,0,0,0,0,0,0]
[null,null,null,"Feiing elektrisk/hydrogen",{"$f":"C292*'Drift og vedlikehold'!G26*Beregningsfaktorer!D78","v":0},"kWh",1,"Drift","Elektrisitet",{"$f":"Utslippsfaktorer!B24","v":"Elektrisitet 55 år, europeisk miks"},{"$f":"SUMIF(Utslippsfaktorer!B:B,Beregninger!J301,Utslippsfaktorer!D:D)","v":0.13600000000000001},{"$f":"VLOOKUP(J301,Utslippsfaktorer!B:C,2,FALSE)","v":"kg CO2e/kWh"},0,{"$f":"SUMIF($O$125:$BV$125,\"<=\" & 'Prosjektbeskrivelse og inndata'!$C$14,O301:BL301)","v":0},0,0,0,0,0,0,0,0,0,0,0,0,0,0,0,0,0,0,0,0,0,0,0,0,0,0,0,0,0,0,0,0,0,0,0,0,0,0,0,0,0,0,0,0,0,0,0,0,0,0,0,0,0,0,0,0,0,0,0,0]
[null,null,null,"Autovern",{"$f":"C292*'Tillegg vei'!D7*Beregningsfaktorer!D83","v":0},"kg stål",{"$f":"Beregningsfaktorer!D51","v":30},"Vedlikehold","Stål",{"$f":"Utslippsfaktorer!B14","v":"Stål"},{"$f":"SUMIF(Utslippsfaktorer!B:B,Beregninger!J302,Utslippsfaktorer!D:D)","v":2.1234999999999999},{"$f":"VLOOKUP(J302,Utslippsfaktorer!B:C,2,FALSE)","v":"kg CO2e/kg"},0,{"$f":"SUMIF($O$125:$BV$125,\"<=\" & 'Prosjektbeskrivelse og inndata'!$C$14,O302:BL302)","v":0},"","","","","","","","","","","","","","","","","","","","","","","","","","","","","",0,"","","","","","","","","","","","","","","","","","","","","","","","","","","","","",0]
[null,null,null,"Utskiftning autovern diesel",{"$f":"C292*'Tillegg vei'!E7*Beregningsfaktorer!D83","v":0},"liter diesel",{"$f":"Beregningsfaktorer!D51","v":30},"Vedlikehold","Diesel",{"$f":"Utslippsfaktorer!B20","v":"Fossil diesel (WTW)"},{"$f":"SUMIF(Utslippsfaktorer!B:B,Beregninger!J303,Utslippsfaktorer!D:D)","v":3.24},{"$f":"VLOOKUP(J303,Utslippsfaktorer!B:C,2,FALSE)","v":"kg CO2e/liter"},0,{"$f":"SUMIF($O$125:$BV$125,\"<=\" & 'Prosjektbeskrivelse og inndata'!$C$14,O303:BL303)","v":0},"","","","","","","","","","","","","","","","","","","","","","","","","","","","","",0,"","","","","","","","","","","","","","","","","","","","","","","","","","","","","",0]
[null,null,null,"Utskiftning autovern biodiesel",{"$f":"C292*'Tillegg vei'!F7*Beregningsfaktorer!D83","v":0},"liter biodiesel",{"$f":"Beregningsfaktorer!D51","v":30},"Vedlikehold","Biodiesel",{"$f":"Utslippsfaktorer!B18","v":"Biodiesel (WTT)"},{"$f":"SUMIF(Utslippsfaktorer!B:B,Beregninger!J304,Utslippsfaktorer!D:D)","v":1.92},{"$f":"VLOOKUP(J304,Utslippsfaktorer!B:C,2,FALSE)","v":"kg CO2e/liter"},0,{"$f":"SUMIF($O$125:$BV$125,\"<=\" & 'Prosjektbeskrivelse og inndata'!$C$14,O304:BL304)","v":0},"","","","","","","","","","","","","","","","","","","","","","","","","","","","","",0,"","","","","","","","","","","","","","","","","","","","","","","","","","","","","",0]
[null,null,null,"Utskiftning autovern elektrisk/hydrogen",{"$f":"C292*'Tillegg vei'!G7*Beregningsfaktorer!D83","v":0},"kWh",{"$f":"Beregningsfaktorer!D51","v":30},"Vedlikehold","Elektrisitet",{"$f":"Utslippsfaktorer!B24","v":"Elektrisitet 55 år, europeisk miks"},{"$f":"SUMIF(Utslippsfaktorer!B:B,Beregninger!J305,Utslippsfaktorer!D:D)","v":0.13600000000000001},{"$f":"VLOOKUP(J305,Utslippsfaktorer!B:C,2,FALSE)","v":"kg CO2e/kWh"},0,{"$f":"SUMIF($O$125:$BV$125,\"<=\" & 'Prosjektbeskrivelse og inndata'!$C$14,O305:BL305)","v":0},"","","","","","","","","","","","","","","","","","","","","","","","","","","","","",0,"","","","","","","","","","","","","","","","","","","","","","","","","","","","","",0]
[null,null,null,"Transport av autovern diesel",{"$f":"C292*'Drift og vedlikehold'!F19*Beregningsfaktorer!D83","v":0},"liter diesel",{"$f":"Beregningsfaktorer!D51","v":30},"Vedlikehold","Diesel",{"$f":"Utslippsfaktorer!B20","v":"Fossil diesel (WTW)"},{"$f":"SUMIF(Utslippsfaktorer!B:B,Beregninger!J306,Utslippsfaktorer!D:D)","v":3.24},{"$f":"VLOOKUP(J306,Utslippsfaktorer!B:C,2,FALSE)","v":"kg CO2e/liter"},0,{"$f":"SUMIF($O$125:$BV$125,\"<=\" & 'Prosjektbeskrivelse og inndata'!$C$14,O306:BL306)","v":0},{"$f":"IF(MOD(O$125,$G306)=0,$M306,\"\")","v":""},"","","","","","","","","",{"$f":"IF(MOD(Y$125,$G306)=0,$M306,\"\")","v":""},"","","","","","","","","",{"$f":"IF(MOD(AI$125,$G306)=0,$M306,\"\")","v":""},"","","","","","","","",0,{"$f":"IF(MOD(AS$125,$G306)=0,$M306,\"\")","v":""},"","","","","","","","","",{"$f":"IF(MOD(BC$125,$G306)=0,$M306,\"\")","v":""},"","","","","","","","","",{"$f":"IF(MOD(BM$125,$G306)=0,$M306,\"\")","v":""},"","","","","","","","",0]
[null,null,null,"Transport av autovern biodiesel",{"$f":"C292*'Drift og vedlikehold'!G19*Beregningsfaktorer!D83","v":0},"liter biodiesel",{"$f":"Beregningsfaktorer!D51","v":30},"Vedlikehold","Biodiesel",{"$f":"Utslippsfaktorer!B18","v":"Biodiesel (WTT)"},{"$f":"SUMIF(Utslippsfaktorer!B:B,Beregninger!J307,Utslippsfaktorer!D:D)","v":1.92},{"$f":"VLOOKUP(J307,Utslippsfaktorer!B:C,2,FALSE)","v":"kg CO2e/liter"},0,{"$f":"SUMIF($O$125:$BV$125,\"<=\" & 'Prosjektbeskrivelse og inndata'!$C$14,O307:BL307)","v":0},"","","","","","","","","","","","","","","","","","","","","","","","","","","","","",0,"","","","","","","","","","","","","","","","","","","","","","","","","","","","","",0]
[null,null,null,"Transport av autovern elektrisk/hydrogen",{"$f":"C292*'Drift og vedlikehold'!H19*Beregningsfaktorer!D83","v":0},"kWh",{"$f":"Beregningsfaktorer!D51","v":30},"Vedlikehold","Elektrisitet",{"$f":"Utslippsfaktorer!B24","v":"Elektrisitet 55 år, europeisk miks"},{"$f":"SUMIF(Utslippsfaktorer!B:B,Beregninger!J308,Utslippsfaktorer!D:D)","v":0.13600000000000001},{"$f":"VLOOKUP(J308,Utslippsfaktorer!B:C,2,FALSE)","v":"kg CO2e/kWh"},0,{"$f":"SUMIF($O$125:$BV$125,\"<=\" & 'Prosjektbeskrivelse og inndata'!$C$14,O308:BL308)","v":0},"","","","","","","","","","","","","","","","","","","","","","","","","","","","","",0,"","","","","","","","","","","","","","","","","","","","","","","","","","","","","",0]
[null,null,null,"Belysning tunnel",{"$f":"C292*2*'Drift og vedlikehold'!H10","v":0},"kWh",1,"Drift","Elektrisitet",{"$f":"Utslippsfaktorer!B24","v":"Elektrisitet 55 år, europeisk miks"},{"$f":"SUMIF(Utslippsfaktorer!B:B,Beregninger!J309,Utslippsfaktorer!D:D)","v":0.13600000000000001},{"$f":"VLOOKUP(J309,Utslippsfaktorer!B:C,2,FALSE)","v":"kg CO2e/kWh"},0,{"$f":"SUMIF($O$125:$BV$125,\"<=\" & 'Prosjektbeskrivelse og inndata'!$C$14,O309:BL309)","v":0},0,0,0,0,0,0,0,0,0,0,0,0,0,0,0,0,0,0,0,0,0,0,0,0,0,0,0,0,0,0,0,0,0,0,0,0,0,0,0,0,0,0,0,0,0,0,0,0,0,0,0,0,0,0,0,0,0,0,0,0]
[null,null,null,"Viftedrift tunnel",{"$f":"C292*'Drift og vedlikehold'!H14","v":0},"kWh",1,"Drift","Elektrisitet",{"$f":"Utslippsfaktorer!B24","v":"Elektrisitet 55 år, europeisk miks"},{"$f":"SUMIF(Utslippsfaktorer!B:B,Beregninger!J310,Utslippsfaktorer!D:D)","v":0.13600000000000001},{"$f":"VLOOKUP(J310,Utslippsfaktorer!B:C,2,FALSE)","v":"kg CO2e/kWh"},0,{"$f":"SUMIF($O$125:$BV$125,\"<=\" & 'Prosjektbeskrivelse og inndata'!$C$14,O310:BL310)","v":0},0,0,0,0,0,0,0,0,0,0,0,0,0,0,0,0,0,0,0,0,0,0,0,0,0,0,0,0,0,0,0,0,0,0,0,0,0,0,0,0,0,0,0,0,0,0,0,0,0,0,0,0,0,0,0,0,0,0,0,0]
[null,null,null,"Pumper tunnel",{"$f":"C292*'Drift og vedlikehold'!H12","v":0},"kWh",1,"Drift","Elektrisitet",{"$f":"Utslippsfaktorer!B24","v":"Elektrisitet 55 år, europeisk miks"},{"$f":"SUMIF(Utslippsfaktorer!B:B,Beregninger!J311,Utslippsfaktorer!D:D)","v":0.13600000000000001},{"$f":"VLOOKUP(J311,Utslippsfaktorer!B:C,2,FALSE)","v":"kg CO2e/kWh"},0,{"$f":"SUMIF($O$125:$BV$125,\"<=\" & 'Prosjektbeskrivelse og inndata'!$C$14,O311:BL311)","v":0},0,0,0,0,0,0,0,0,0,0,0,0,0,0,0,0,0,0,0,0,0,0,0,0,0,0,0,0,0,0,0,0,0,0,0,0,0,0,0,0,0,0,0,0,0,0,0,0,0,0,0,0,0,0,0,0,0,0,0,0]

{"sheet":"Drift og vedlikehold","index":8,"n_rows":29,"n_cols":10,"rows_kept":29,"cut":false,"hidden":false,"merged":[[27,7,27,9],[28,7,28,9],[4,1,4,9],[20,1,20,9],[21,7,21,9],[22,7,22,9],[23,7,23,9],[21,4,21,6],[14,1,15,1],[7,1,13,1],[5,5,5,8],[24,7,24,9],[25,7,25,9],[26,7,26,9]]}
[null,"Drift og vedlikehold"]
[null,"Bakgrunnsdata"]
[null,"ÅDT",{"$f":"'Prosjektbeskrivelse og inndata'!C15","v":3850}]
[]
[null,"Materialer, strømforbruk og transport "]
[null,"Hovedkategori","Underkategori","Type innsatsfaktor","Materialmengder","Energiforbruk",null,null,null,"Kommentar"]
[null,null,null,null,"Masse per veistrekning\n[kg/m]","Mengde diesel\n[liter/m]","Mengde bio \n[liter/m]","Mengde el\n[kWh/m]","Mengde el\n[kWh/(m*m)]","Alle mengder i denne fanen er oppgitt per år. For vedlikehold som utføres med utskiftningsintervaller gjelder verdiene for de årene der det skjer vedlikehold. Anleggsvei er utelatt fra alle beregninger knyttet til drift. "]
[null,"Kontinuerlig drift","Belysning hovedvei i dagen","Elektrisitet",null,null,null,{"$f":"Beregningsfaktorer!D60*Beregningsfaktorer!D74/1000","v":34},null,"Blir ganget med antall belysningsrekker og total lengde vei i dagen og bru for å finne samlet forbruk for strekning."]
[null,null,"Belysning sidevei i dagen","Elektrisitet",null,null,null,{"$f":"Beregningsfaktorer!D60*Beregningsfaktorer!D75/1000","v":34},null,"Blir ganget med antall belysningsrekker og total lengde sidevei i dagen for å finne samlet forbruk for strekning."]
[null,null,"Belysning tunnel","Elektrisitet",null,null,null,{"$f":"Beregningsfaktorer!D61","v":34},null,"Blir ganget med antall løp og tunnellengde for å finne forbruk for hver tunnel."]
[null,null,"Pumpedrift enkeltløpstunnel","Elektrisitet",null,null,null,{"$f":"Beregningsfaktorer!D67*Beregningsfaktorer!D47+Beregningsfaktorer!D66*(1-Beregningsfaktorer!D47)","v":0},null,"Blir ganget med total lengde enkeltløpstunnel for å finne samlet forbruk for strekning."]
[null,null,"Pumpedrift dobbeltløpstunnel","Elektrisitet",null,null,null,{"$f":"Beregningsfaktorer!D67*2*Beregningsfaktorer!D48+Beregningsfaktorer!D66*2*(1-Beregningsfaktorer!D48)","v":0},null,"Blir ganget med total lengde dobbeltløpstunnel for å finne samlet forbruk for strekning."]
[null,null,"Viftedrift enkeltløpstunnel","Elektrisitet",null,null,null,{"$f":"Beregningsfaktorer!D47*Beregningsfaktorer!D63/1000*'Drift og vedlikehold'!C3+(1-Beregningsfaktorer!D47)*Beregningsfaktorer!D62/1000*'Drift og vedlikehold'!C3","v":14.245000000000001},null,"Blir ganget med total lengde enkelttløpstunnel for å finne samlet forbruk for strekningen. Formel fra Metoderapport s. 46"]
[null,null,"Viftedrift dobbeltløpstunnel","Elektrisitet",null,null,null,{"$f":"Beregningsfaktorer!D48*Beregningsfaktorer!D65/1000*'Drift og vedlikehold'!C3+(1-Beregningsfaktorer!D48)*Beregningsfaktorer!D64/1000*'Drift og vedlikehold'!C3","v":14.245000000000001},null,"Blir ganget med total lengde dobbeltløpstunnel for å finne samlet forbruk for strekningen. Formel fra Metoderapport s. 46"]
[null,"Sesongdrift","Grøfterensk","Jordmasser/vegetasjon",{"$f":"Beregningsfaktorer!D17*Beregningsfaktorer!D71","v":172.9},{"$f":"E15/1000*'Transport og energibehov'!D5*'Transport og energibehov'!D29*'Transport og energibehov'!N29","v":1.6079699999999999E-2},{"$f":"E15/1000*'Transport og energibehov'!D5*'Transport og energibehov'!D29*'Transport og energibehov'!M29","v":1.2103000000000001E-3},{"$f":"E15/1000*'Transport og energibehov'!D5*'Transport og energibehov'!H29*'Transport og energibehov'!L29","v":0},null,"Driftsintervall med standardverdi 3 år (kan erstattes med prosjektspesifikk verdi i beregningsfaktorfane). Blir ganget med antall grøfter og total strekningslengde for å finne samlet forbruk for strekningen. "]
[null,null,"Salt","Salt",{"$f":"Beregningsfaktorer!D68*1000/1000","v":10.5},{"$f":"E16/1000*'Transport og energibehov'!D15*'Transport og energibehov'!D29*'Transport og energibehov'!N29","v":9.7649999999999987E-2},{"$f":"E16/1000*'Transport og energibehov'!D15*'Transport og energibehov'!D29*'Transport og energibehov'!M29","v":7.3500000000000006E-3},{"$f":"E16/1000*'Transport og energibehov'!D15*'Transport og energibehov'!H29*'Transport og energibehov'!L29","v":0},null,"Blir ganget med total strekningslengde for å finne samlet forbruk for strekningen. "]
[null,"Vedlikehold","Lyktestolper hovedvei og bru utskiftning","Stål",{"$f":"Beregningsfaktorer!D73*Beregningsfaktorer!D74/1000","v":4.8237500000000004},{"$f":"(E17/1000)*'Transport og energibehov'!D25*'Transport og energibehov'!D11*'Transport og energibehov'!N25","v":3.5888700000000003E-2},{"$f":"(E17/1000)*'Transport og energibehov'!D25*'Transport og energibehov'!D11*'Transport og energibehov'!M25","v":2.7013000000000007E-3},{"$f":"(E17/1000)*'Transport og energibehov'!H24*'Transport og energibehov'!D11*'Transport og energibehov'!L25","v":0},null,"Utskiftningintervall gitt av levetid med standardverdi lik 30 år (kan erstattes med prosjektspesifikk verdi i beregningsfaktorfanen). Blir ganget med antall belysningsrekker og total lengde vei i dagen og bru for å finne samlet forbruk for strekningen."]
[null,null,"Lyktestolper sidevei utskiftning","Stål",{"$f":"Beregningsfaktorer!D73*Beregningsfaktorer!D75/1000","v":4.8237500000000004},{"$f":"(E18/1000)*'Transport og energibehov'!D25*'Transport og energibehov'!D11*'Transport og energibehov'!N25","v":3.5888700000000003E-2},{"$f":"(E18/1000)*'Transport og energibehov'!D25*'Transport og energibehov'!D11*'Transport og energibehov'!M25","v":2.7013000000000007E-3},{"$f":"(E18/1000)*'Transport og energibehov'!H24*'Transport og energibehov'!D11*'Transport og energibehov'!L25","v":0},null,"Utskiftningintervall gitt av levetid med standardverdi lik 30 år (kan erstattes med prosjektspesifikk verdi i beregningsfaktorfanen). Blir ganget med antall belysningsrekker og total lengde sidevei i for å finne samlet forbruk for strekningen."]
[null,null,"Autovern/rekkverk utskiftning","Stål",{"$f":"Beregningsfaktorer!D76","v":16.5},{"$f":"(E19/1000)*'Transport og energibehov'!D25*'Transport og energibehov'!D11*'Transport og energibehov'!N25","v":0.12275999999999999},{"$f":"(E19/1000)*'Transport og energibehov'!D25*'Transport og energibehov'!D11*'Transport og energibehov'!M25","v":9.2400000000000017E-3},{"$f":"(E19/1000)*'Transport og energibehov'!H24*'Transport og energibehov'!D11*'Transport og energibehov'!L25","v":0},null,"Utskiftningintervall gitt av levetid med standardverdi lik 30 år (kan erstattes med prosjektspesifikk verdi i beregningsfaktorfanen). Blir ganget med antall rekkverk og total strekningslengde for å finne samlet forbruk for strekningen."]
[]
[null,"Anleggsarbeid"]
[null,"Hovedkategori","Kategori","Maskintype","Energiforbruk",null,null,"Kommentar"]
[null,null,null,null,"Mengde diesel\n[liter/m]","Mengde bio\n[liter/m]","Mengde el\n[kWh/m]","Alle mengder i denne fanen er oppgitt per år. For vedlikehold som utføres med utskiftningsintervaller gjelder verdiene for de årene der det skjer vedlikehold. Anleggsvei er utelatt fra alle beregninger knyttet til drift. "]
[null,"Sesongdrift","Kantklipp","Hjullaster/traktor",{"$f":"'Transport og energibehov'!D41/'Transport og energibehov'!D57*'Transport og energibehov'!N41","v":9.2999999999999995E-4},{"$f":"'Transport og energibehov'!D41/'Transport og energibehov'!D57*'Transport og energibehov'!M41","v":7.0000000000000007E-5},{"$f":"'Transport og energibehov'!H41/'Transport og energibehov'!D57*'Transport og energibehov'!L41","v":0},"Blir ganget med total lengde vei i dagen og antall grøfter for å finne samlet forbruk for strekningen. "]
[null,null,"Grøfterensk","Gravemaskin",{"$f":"'Transport og energibehov'!D34/'Transport og energibehov'!D55*'Transport og energibehov'!N34","v":6.1999999999999993E-2},{"$f":"'Transport og energibehov'!D34/'Transport og energibehov'!D55*'Transport og energibehov'!M34","v":4.6666666666666671E-3},{"$f":"'Transport og energibehov'!H34/'Transport og energibehov'!D55*'Transport og energibehov'!L34","v":0},"Driftsintervall med standardverdi 3 år (kan erstattes med prosjektspesifikk verdi i beregningsfaktorfane). Blir ganget med antall grøfter og total strekningslengde for å finne samlet forbruk for strekningen. "]
[null,null,"Feiing","Hjullaster",{"$f":"'Transport og energibehov'!D42/'Transport og energibehov'!D56*'Transport og energibehov'!N42","v":3.4874999999999997E-3},{"$f":"'Transport og energibehov'!D42/'Transport og energibehov'!D56*'Transport og energibehov'!M42","v":2.6250000000000004E-4},{"$f":"'Transport og energibehov'!H42/'Transport og energibehov'!D56*'Transport og energibehov'!L42","v":0},"Blir ganget med strekningslengde og antall felt for å finne samlet forbruk for hver del av strekningen. "]
[null,null,"Strøing av salt","Saltbil (lastebil)",{"$f":"'Transport og energibehov'!D43/1000*Beregningsfaktorer!D70*'Transport og energibehov'!N43","v":5.9519999999999997E-2},{"$f":"'Transport og energibehov'!D43/1000*Beregningsfaktorer!D70*'Transport og energibehov'!M43","v":4.4800000000000005E-3},{"$f":"'Transport og energibehov'!H43/1000*Beregningsfaktorer!D70*'Transport og energibehov'!L43","v":0},"Blir ganget med total lengde vei i dagen og bru og halvparten av antall felt for å finne samlet forbruk for hver del av strekningen (antar at to og to felt saltes). "]
[null,null,"Brøyting","Brøytebil",{"$f":"'Transport og energibehov'!D44/1000*Beregningsfaktorer!D69*'Transport og energibehov'!N44","v":0.43134144000000002},{"$f":"'Transport og energibehov'!D44/1000*Beregningsfaktorer!D69*'Transport og energibehov'!M44","v":3.2466560000000005E-2},{"$f":"'Transport og energibehov'!H44/1000*Beregningsfaktorer!D69*'Transport og energibehov'!L44","v":0},"Blir ganget med total lengde vei i dagen og bru for å finne samlet forbruk for hver del av strekningen. "]
[null,"Vedlikehold","Utskiftning av autovern/rekkverk","Pelerigg/lastebil",{"$f":"'Transport og energibehov'!D40*'Transport og energibehov'!N40","v":0.372},{"$f":"'Transport og energibehov'!D40*'Transport og energibehov'!M40","v":2.8000000000000004E-2},{"$f":"'Transport og energibehov'!H40*'Transport og energibehov'!L40","v":0},"Utskiftningintervall gitt av levetid med standardverdi lik 30 år (kan erstattes med prosjektspesifikk verdi i beregningsfaktorfanen). Blir ganget med antall rekkverk og total strekningslengde for å finne samlet forbruk for strekningen."]

{"sheet":"Hovedvei","index":9,"n_rows":28,"n_cols":8,"rows_kept":28,"cut":false,"hidden":false,"merged":[[2,2,2,3],[11,1,11,7],[12,3,12,6],[2,4,2,6],[1,1,1,7]]}
[]
[null,"Materialer og transport"]
[null,"Kategori","Materialmengder",null,"Transport",null,null,"Kommentar"]
[null,null,"Volum per areal\n[m3/m2]","Masse per areal\n[kg/m2]","Mengde diesel\n[liter/m2]","Mengde bio \n[liter/m2]","Mengde el\n[kWh/m2]"]
[null,"Slitelag (Ska)",{"$f":"Beregningsfaktorer!D19","v":4.4999999999999998E-2},{"$f":"C5*Beregningsfaktorer!D7","v":112.5},{"$f":"(D5/1000)*'Transport og energibehov'!D20*'Transport og energibehov'!D7*'Transport og energibehov'!N20","v":6.2774999999999997E-2},{"$f":"(D5/1000)*'Transport og energibehov'!D20*'Transport og energibehov'!D7*'Transport og energibehov'!M20","v":4.7250000000000009E-3},{"$f":"(D5/1000)*'Transport og energibehov'!H20*'Transport og energibehov'!D7*'Transport og energibehov'!L20","v":0}]
[null,"Bindlag (Agb)",{"$f":"Beregningsfaktorer!D20","v":3.5000000000000003E-2},{"$f":"C6*Beregningsfaktorer!D7","v":87.500000000000014},{"$f":"(D6/1000)*'Transport og energibehov'!D20*'Transport og energibehov'!D7*'Transport og energibehov'!N20","v":4.8825E-2},{"$f":"(D6/1000)*'Transport og energibehov'!D20*'Transport og energibehov'!D7*'Transport og energibehov'!M20","v":3.6750000000000007E-3},{"$f":"(D6/1000)*'Transport og energibehov'!H20*'Transport og energibehov'!D7*'Transport og energibehov'!L20","v":0}]
[null,"Bærelag (Ag)",{"$f":"Beregningsfaktorer!D21","v":0.13},{"$f":"C7*Beregningsfaktorer!D8","v":312},{"$f":"(D7/1000)*'Transport og energibehov'!D21*'Transport og energibehov'!D8*'Transport og energibehov'!N21","v":0.174096},{"$f":"(D7/1000)*'Transport og energibehov'!D21*'Transport og energibehov'!D8*'Transport og energibehov'!M21","v":1.3104000000000001E-2},{"$f":"(D7/1000)*'Transport og energibehov'!H21*'Transport og energibehov'!D8*'Transport og energibehov'!L21","v":0}]
[null,"Forsterkningslag",{"$f":"Beregningsfaktorer!D22","v":0.45},{"$f":"C8*Beregningsfaktorer!D10","v":697.5},{"$f":"(D8/1000)*'Transport og energibehov'!D22*'Transport og energibehov'!D9*'Transport og energibehov'!N22","v":0.19460250000000001},{"$f":"(D8/1000)*'Transport og energibehov'!D22*'Transport og energibehov'!D9*'Transport og energibehov'!M22","v":1.4647500000000003E-2},{"$f":"(D8/1000)*'Transport og energibehov'!H22*'Transport og energibehov'!D9*'Transport og energibehov'!L22","v":0}]
[null,"Frostsikringslag",{"$f":"Beregningsfaktorer!D23","v":1.74},{"$f":"C9*Beregningsfaktorer!D9","v":2697},{"$f":"(D9/1000)*'Transport og energibehov'!D22*'Transport og energibehov'!D9*'Transport og energibehov'!N22","v":0.75246299999999999},{"$f":"(D9/1000)*'Transport og energibehov'!D22*'Transport og energibehov'!D9*'Transport og energibehov'!M22","v":5.6637000000000007E-2},{"$f":"(D9/1000)*'Transport og energibehov'!H22*'Transport og energibehov'!D9*'Transport og energibehov'!L22","v":0}]
[]
[]
[null,"Anleggsarbeid"]
[null,"Kategori","Maskintype","Anleggsarbeid",null,null,null,"Kommentar"]
[null,null,null,"Anleggsarbeid\n[m2/time]","Mengde diesel \n[liter/m2]","Mengde bio\n[liter/m2]","Mengde el\n[kWh/m2]"]
[null,"Slitelag","Veivals",{"$f":"('Transport og energibehov'!D46*1000)/D5","v":666.66666666666663},{"$f":"('Transport og energibehov'!D31/D15)*'Transport og energibehov'!N31","v":4.1850000000000004E-3},{"$f":"('Transport og energibehov'!D31/D15)*'Transport og energibehov'!M31","v":3.1500000000000007E-4},{"$f":"('Transport og energibehov'!H31/D15)*'Transport og energibehov'!L31","v":0}]
[null,null,"Traktor",{"$f":"('Transport og energibehov'!D47*1000)/D5","v":2666.6666666666665},{"$f":"('Transport og energibehov'!D32/D16)*'Transport og energibehov'!N32","v":1.7437500000000001E-3},{"$f":"('Transport og energibehov'!D32/D16)*'Transport og energibehov'!M32","v":1.3125000000000002E-4},{"$f":"('Transport og energibehov'!H32/D16)*'Transport og energibehov'!L32","v":0}]
[null,null,"Asfaltutlegger",{"$f":"('Transport og energibehov'!D48*1000)/D5","v":33.333333333333336},{"$f":"('Transport og energibehov'!D33/D17)*'Transport og energibehov'!N33","v":8.3699999999999997E-2},{"$f":"('Transport og energibehov'!D33/D17)*'Transport og energibehov'!M33","v":6.3E-3},{"$f":"('Transport og energibehov'!H33/D17)*'Transport og energibehov'!L33","v":0}]
[null,"Bindlag","Veivals",{"$f":"('Transport og energibehov'!D46*1000)/D6","v":857.142857142857},{"$f":"('Transport og energibehov'!D31/D18)*'Transport og energibehov'!N31","v":3.2550000000000001E-3},{"$f":"('Transport og energibehov'!D31/D18)*'Transport og energibehov'!M31","v":2.4500000000000005E-4},{"$f":"('Transport og energibehov'!H31/D18)*'Transport og energibehov'!L31","v":0}]
[null,null,"Traktor",{"$f":"('Transport og energibehov'!D47*1000)/D6","v":3428.571428571428},{"$f":"('Transport og energibehov'!D32/D19)*'Transport og energibehov'!N32","v":1.3562500000000003E-3},{"$f":"('Transport og energibehov'!D32/D19)*'Transport og energibehov'!M32","v":1.0208333333333337E-4},{"$f":"('Transport og energibehov'!H32/D19)*'Transport og energibehov'!L32","v":0}]
[null,null,"Asfaltutlegger",{"$f":"('Transport og energibehov'!D48*1000)/D6","v":42.857142857142847},{"$f":"('Transport og energibehov'!D33/D20)*'Transport og energibehov'!N33","v":6.5100000000000019E-2},{"$f":"('Transport og energibehov'!D33/D20)*'Transport og energibehov'!M33","v":4.9000000000000016E-3},{"$f":"('Transport og energibehov'!H33/D20)*'Transport og energibehov'!L33","v":0}]
[null,"Bærelag","Veivals",{"$f":"('Transport og energibehov'!D46*1000)/D7","v":240.38461538461539},{"$f":"('Transport og energibehov'!D31/D21)*'Transport og energibehov'!N31","v":1.1606399999999999E-2},{"$f":"('Transport og energibehov'!D31/D21)*'Transport og energibehov'!M31","v":8.7360000000000009E-4},{"$f":"('Transport og energibehov'!H31/D21)*'Transport og energibehov'!L31","v":0}]
[null,null,"Traktor",{"$f":"('Transport og energibehov'!D47*1000)/D7","v":961.53846153846155},{"$f":"('Transport og energibehov'!D32/D22)*'Transport og energibehov'!N32","v":4.8359999999999992E-3},{"$f":"('Transport og energibehov'!D32/D22)*'Transport og energibehov'!M32","v":3.6400000000000001E-4},{"$f":"('Transport og energibehov'!H32/D22)*'Transport og energibehov'!L32","v":0}]
[null,null,"Asfaltutlegger",{"$f":"('Transport og energibehov'!D48*1000)/D7","v":12.01923076923077},{"$f":"('Transport og energibehov'!D33/D23)*'Transport og energibehov'!N33","v":0.23212799999999997},{"$f":"('Transport og energibehov'!D33/D23)*'Transport og energibehov'!M33","v":1.7472000000000001E-2},{"$f":"('Transport og energibehov'!H33/D23)*'Transport og energibehov'!L33","v":0}]
[null,"Forsterkningslag","Gravemaskin",{"$f":"('Transport og energibehov'!D49*1000)/D8","v":215.05376344086022},{"$f":"('Transport og energibehov'!D34/D24)*'Transport og energibehov'!N34","v":8.6489999999999997E-2},{"$f":"('Transport og energibehov'!D34/D24)*'Transport og energibehov'!M34","v":6.5100000000000002E-3},{"$f":"('Transport og energibehov'!H34/D24)*'Transport og energibehov'!L34","v":0}]
[null,null,"Grovknuser",{"$f":"('Transport og energibehov'!D50*1000)/D8","v":179.21146953405017},{"$f":"('Transport og energibehov'!D35/D25)*'Transport og energibehov'!N35","v":0.12973500000000002},{"$f":"('Transport og energibehov'!D35/D25)*'Transport og energibehov'!M35","v":9.7650000000000011E-3},{"$f":"('Transport og energibehov'!H35/D25)*'Transport og energibehov'!L35","v":0}]
[null,"Frostsikringslag","Gravemaskin",{"$f":"('Transport og energibehov'!D49*1000)/D9","v":55.617352614015573},{"$f":"('Transport og energibehov'!D34/D26)*'Transport og energibehov'!N34","v":0.33442799999999995},{"$f":"('Transport og energibehov'!D34/D26)*'Transport og energibehov'!M34","v":2.5172E-2},{"$f":"('Transport og energibehov'!H34/D26)*'Transport og energibehov'!L34","v":0}]
[null,null,"Grovknuser",{"$f":"('Transport og energibehov'!D50*1000)/D9","v":46.34779384501298},{"$f":"('Transport og energibehov'!D35/D27)*'Transport og energibehov'!N35","v":0.50164199999999992},{"$f":"('Transport og energibehov'!D35/D27)*'Transport og energibehov'!M35","v":3.7758E-2},{"$f":"('Transport og energibehov'!H35/D27)*'Transport og energibehov'!L35","v":0}]
[null,null,"Finknuser",{"$f":"('Transport og energibehov'!D51*1000)/D9","v":92.69558769002596},{"$f":"('Transport og energibehov'!D36/D28)*'Transport og energibehov'!N36","v":0.25082099999999996},{"$f":"('Transport og energibehov'!D36/D28)*'Transport og energibehov'!M36","v":1.8879E-2},{"$f":"('Transport og energibehov'!H36/D28)*'Transport og energibehov'!L36","v":0}]

{"sheet":"Sidevei","index":10,"n_rows":28,"n_cols":8,"rows_kept":28,"cut":false,"hidden":false,"merged":[[1,1,1,7],[2,2,2,3],[2,4,2,6],[11,1,11,7],[12,3,12,6]]}
[]
[null,"Materialer og transport"]
[null,"Kategori","Materialmengder",null,"Transport",null,null,"Kommentar"]
[null,null,"Volum per areal\n[m3/m2]","Masse per areal\n[kg/m2]","Mengde diesel\n[liter/m2]","Mengde bio \n[liter/m2]","Mengde el\n[kWh/m2]"]
[null,"Slitelag (Agb)",{"$f":"Beregningsfaktorer!D19","v":4.4999999999999998E-2},{"$f":"C5*Beregningsfaktorer!D7","v":112.5},{"$f":"(D5/1000)*'Transport og energibehov'!D20*'Transport og energibehov'!D7*'Transport og energibehov'!N20","v":6.2774999999999997E-2},{"$f":"(D5/1000)*'Transport og energibehov'!D20*'Transport og energibehov'!D7*'Transport og energibehov'!M20","v":4.7250000000000009E-3},{"$f":"(D5/1000)*'Transport og energibehov'!H20*'Transport og energibehov'!D7*'Transport og energibehov'!L20","v":0}]
[null,"Bindlag (Agb)",{"$f":"Beregningsfaktorer!D20","v":3.5000000000000003E-2},{"$f":"C6*Beregningsfaktorer!D7","v":87.500000000000014},{"$f":"(D6/1000)*'Transport og energibehov'!D20*'Transport og energibehov'!D7*'Transport og energibehov'!N20","v":4.8825E-2},{"$f":"(D6/1000)*'Transport og energibehov'!D20*'Transport og energibehov'!D7*'Transport og energibehov'!M20","v":3.6750000000000007E-3},{"$f":"(D6/1000)*'Transport og energibehov'!H20*'Transport og energibehov'!D7*'Transport og energibehov'!L20","v":0}]
[null,"Bærelag (Ag)",{"$f":"Beregningsfaktorer!D21","v":0.13},{"$f":"C7*Beregningsfaktorer!D8","v":312},{"$f":"(D7/1000)*'Transport og energibehov'!D21*'Transport og energibehov'!D8*'Transport og energibehov'!N21","v":0.174096},{"$f":"(D7/1000)*'Transport og energibehov'!D21*'Transport og energibehov'!D8*'Transport og energibehov'!M21","v":1.3104000000000001E-2},{"$f":"(D7/1000)*'Transport og energibehov'!H21*'Transport og energibehov'!D8*'Transport og energibehov'!L21","v":0}]
[null,"Forsterkningslag",{"$f":"Beregningsfaktorer!D22","v":0.45},{"$f":"C8*Beregningsfaktorer!D10","v":697.5},{"$f":"(D8/1000)*'Transport og energibehov'!D22*'Transport og energibehov'!D9*'Transport og energibehov'!N22","v":0.19460250000000001},{"$f":"(D8/1000)*'Transport og energibehov'!D22*'Transport og energibehov'!D9*'Transport og energibehov'!M22","v":1.4647500000000003E-2},{"$f":"(D8/1000)*'Transport og energibehov'!H22*'Transport og energibehov'!D9*'Transport og energibehov'!L22","v":0}]
[null,"Frostsikringslag",{"$f":"Beregningsfaktorer!D23","v":1.74},{"$f":"C9*Beregningsfaktorer!D9","v":2697},{"$f":"(D9/1000)*'Transport og energibehov'!D22*'Transport og energibehov'!D9*'Transport og energibehov'!N22","v":0.75246299999999999},{"$f":"(D9/1000)*'Transport og energibehov'!D22*'Transport og energibehov'!D9*'Transport og energibehov'!M22","v":5.6637000000000007E-2},{"$f":"(D9/1000)*'Transport og energibehov'!H22*'Transport og energibehov'!D9*'Transport og energibehov'!L22","v":0}]
[]
[]
[null,"Anleggsarbeid"]
[null,"Kategori","Maskintype","Anleggsarbeid",null,null,null,"Kommentar"]
[null,null,null,"Anleggsarbeid\n[m2/time]","Mengde diesel \n[liter/m2]","Mengde bio\n[liter/m2]","Mengde el\n[kWh/m2]"]
[null,"Slitelag","Veivals",{"$f":"('Transport og energibehov'!D46*1000)/D5","v":666.66666666666663},{"$f":"('Transport og energibehov'!D31/D15)*'Transport og energibehov'!N31","v":4.1850000000000004E-3},{"$f":"('Transport og energibehov'!D31/D15)*'Transport og energibehov'!M31","v":3.1500000000000007E-4},{"$f":"('Transport og energibehov'!H31/D15)*'Transport og energibehov'!L31","v":0}]
[null,null,"Traktor",{"$f":"('Transport og energibehov'!D47*1000)/D5","v":2666.6666666666665},{"$f":"('Transport og energibehov'!D32/D16)*'Transport og energibehov'!N32","v":1.7437500000000001E-3},{"$f":"('Transport og energibehov'!D32/D16)*'Transport og energibehov'!M32","v":1.3125000000000002E-4},{"$f":"('Transport og energibehov'!H32/D16)*'Transport og energibehov'!L32","v":0}]
[null,null,"Asfaltutlegger",{"$f":"('Transport og energibehov'!D48*1000)/D5","v":33.333333333333336},{"$f":"('Transport og energibehov'!D33/D17)*'Transport og energibehov'!N33","v":8.3699999999999997E-2},{"$f":"('Transport og energibehov'!D33/D17)*'Transport og energibehov'!M33","v":6.3E-3},{"$f":"('Transport og energibehov'!H33/D17)*'Transport og energibehov'!L33","v":0}]
[null,"Bindlag","Veivals",{"$f":"('Transport og energibehov'!D46*1000)/D6","v":857.142857142857},{"$f":"('Transport og energibehov'!D31/D18)*'Transport og energibehov'!N31","v":3.2550000000000001E-3},{"$f":"('Transport og energibehov'!D31/D18)*'Transport og energibehov'!M31","v":2.4500000000000005E-4},{"$f":"('Transport og energibehov'!H31/D18)*'Transport og energibehov'!L31","v":0}]
[null,null,"Traktor",{"$f":"('Transport og energibehov'!D47*1000)/D6","v":3428.571428571428},{"$f":"('Transport og energibehov'!D32/D19)*'Transport og energibehov'!N32","v":1.3562500000000003E-3},{"$f":"('Transport og energibehov'!D32/D19)*'Transport og energibehov'!M32","v":1.0208333333333337E-4},{"$f":"('Transport og energibehov'!H32/D19)*'Transport og energibehov'!L32","v":0}]
[null,null,"Asfaltutlegger",{"$f":"('Transport og energibehov'!D48*1000)/D6","v":42.857142857142847},{"$f":"('Transport og energibehov'!D33/D20)*'Transport og energibehov'!N33","v":6.5100000000000019E-2},{"$f":"('Transport og energibehov'!D33/D20)*'Transport og energibehov'!M33","v":4.9000000000000016E-3},{"$f":"('Transport og energibehov'!H33/D20)*'Transport og energibehov'!L33","v":0}]
[null,"Bærelag","Veivals",{"$f":"('Transport og energibehov'!D46*1000)/D7","v":240.38461538461539},{"$f":"('Transport og energibehov'!D31/D21)*'Transport og energibehov'!N31","v":1.1606399999999999E-2},{"$f":"('Transport og energibehov'!D31/D21)*'Transport og energibehov'!M31","v":8.7360000000000009E-4},{"$f":"('Transport og energibehov'!H31/D21)*'Transport og energibehov'!L31","v":0}]
[null,null,"Traktor",{"$f":"('Transport og energibehov'!D47*1000)/D7","v":961.53846153846155},{"$f":"('Transport og energibehov'!D32/D22)*'Transport og energibehov'!N32","v":4.8359999999999992E-3},{"$f":"('Transport og energibehov'!D32/D22)*'Transport og energibehov'!M32","v":3.6400000000000001E-4},{"$f":"('Transport og energibehov'!H32/D22)*'Transport og energibehov'!L32","v":0}]
[null,null,"Asfaltutlegger",{"$f":"('Transport og energibehov'!D48*1000)/D7","v":12.01923076923077},{"$f":"('Transport og energibehov'!D33/D23)*'Transport og energibehov'!N33","v":0.23212799999999997},{"$f":"('Transport og energibehov'!D33/D23)*'Transport og energibehov'!M33","v":1.7472000000000001E-2},{"$f":"('Transport og energibehov'!H33/D23)*'Transport og energibehov'!L33","v":0}]
[null,"Forsterkningslag","Gravemaskin",{"$f":"('Transport og energibehov'!D49*1000)/D8","v":215.05376344086022},{"$f":"('Transport og energibehov'!D34/D24)*'Transport og energibehov'!N34","v":8.6489999999999997E-2},{"$f":"('Transport og energibehov'!D34/D24)*'Transport og energibehov'!M34","v":6.5100000000000002E-3},{"$f":"('Transport og energibehov'!H34/D24)*'Transport og energibehov'!L34","v":0}]
[null,null,"Grovknuser",{"$f":"('Transport og energibehov'!D50*1000)/D8","v":179.21146953405017},{"$f":"('Transport og energibehov'!D35/D25)*'Transport og energibehov'!N35","v":0.12973500000000002},{"$f":"('Transport og energibehov'!D35/D25)*'Transport og energibehov'!M35","v":9.7650000000000011E-3},{"$f":"('Transport og energibehov'!H35/D25)*'Transport og energibehov'!L35","v":0}]
[null,"Frostsikringslag","Gravemaskin",{"$f":"('Transport og energibehov'!D49*1000)/D9","v":55.617352614015573},{"$f":"('Transport og energibehov'!D34/D26)*'Transport og energibehov'!N34","v":0.33442799999999995},{"$f":"('Transport og energibehov'!D34/D26)*'Transport og energibehov'!M34","v":2.5172E-2},{"$f":"('Transport og energibehov'!H34/D26)*'Transport og energibehov'!L34","v":0}]
[null,null,"Grovknuser",{"$f":"('Transport og energibehov'!D50*1000)/D9","v":46.34779384501298},{"$f":"('Transport og energibehov'!D35/D27)*'Transport og energibehov'!N35","v":0.50164199999999992},{"$f":"('Transport og energibehov'!D35/D27)*'Transport og energibehov'!M35","v":3.7758E-2},{"$f":"('Transport og energibehov'!H35/D27)*'Transport og energibehov'!L35","v":0}]
[null,null,"Finknuser",{"$f":"('Transport og energibehov'!D51*1000)/D9","v":92.69558769002596},{"$f":"('Transport og energibehov'!D36/D28)*'Transport og energibehov'!N36","v":0.25082099999999996},{"$f":"('Transport og energibehov'!D36/D28)*'Transport og energibehov'!M36","v":1.8879E-2},{"$f":"('Transport og energibehov'!H36/D28)*'Transport og energibehov'!L36","v":0}]

{"sheet":"Anleggsvei","index":11,"n_rows":16,"n_cols":8,"rows_kept":16,"cut":false,"hidden":false,"merged":[[1,1,1,7],[2,2,2,3],[2,4,2,6],[8,1,8,7],[9,3,9,6]]}
[]
[null,"Materialer og transport"]
[null,"Kategori","Materialmengder",null,"Transport",null,null,"Kommentar"]
[null,null,"Volum per areal\n[m3/m2]","Masse per areal\n[kg/m2]","Mengde diesel\n[liter/m2]","Mengde bio \n[liter/m2]","Mengde el\n[kWh/m2]"]
[null,"Bærelag (Ag)",{"$f":"Beregningsfaktorer!D21","v":0.13},{"$f":"C5*Beregningsfaktorer!D8","v":312},{"$f":"(D5/1000)*'Transport og energibehov'!D21*'Transport og energibehov'!D8*'Transport og energibehov'!N21","v":0.174096},{"$f":"(D5/1000)*'Transport og energibehov'!D21*'Transport og energibehov'!D8*'Transport og energibehov'!M21","v":1.3104000000000001E-2},{"$f":"(D5/1000)*'Transport og energibehov'!H21*'Transport og energibehov'!D8*'Transport og energibehov'!L21","v":0}]
[null,"Forsterkningslag",{"$f":"Beregningsfaktorer!D22","v":0.45},{"$f":"C6*Beregningsfaktorer!D10","v":697.5},{"$f":"(D6/1000)*'Transport og energibehov'!D22*'Transport og energibehov'!D9*'Transport og energibehov'!N22","v":0.19460250000000001},{"$f":"(D6/1000)*'Transport og energibehov'!D22*'Transport og energibehov'!D9*'Transport og energibehov'!M22","v":1.4647500000000003E-2},{"$f":"(D6/1000)*'Transport og energibehov'!H22*'Transport og energibehov'!D9*'Transport og energibehov'!L22","v":0}]
[]
[]
[null,"Anleggsarbeid"]
[null,"Kategori","Maskintype","Anleggsarbeid",null,null,null,"Kommentar"]
[null,null,null,"Anleggsarbeid\n[m2/time]","Mengde diesel \n[liter/m2]","Mengde bio\n[liter/m2]","Mengde el\n[kWh/m2]"]
[null,"Bærelag","Veivals",{"$f":"('Transport og energibehov'!D46*1000)/D5","v":240.38461538461539},{"$f":"('Transport og energibehov'!D31/D12)*'Transport og energibehov'!N31","v":1.1606399999999999E-2},{"$f":"('Transport og energibehov'!D31/D12)*'Transport og energibehov'!M31","v":8.7360000000000009E-4},{"$f":"('Transport og energibehov'!H31/D12)*'Transport og energibehov'!L31","v":0}]
[null,null,"Traktor",{"$f":"('Transport og energibehov'!D47*1000)/D5","v":961.53846153846155},{"$f":"('Transport og energibehov'!D32/D13)*'Transport og energibehov'!N32","v":4.8359999999999992E-3},{"$f":"('Transport og energibehov'!D32/D13)*'Transport og energibehov'!M32","v":3.6400000000000001E-4},{"$f":"('Transport og energibehov'!H32/D13)*'Transport og energibehov'!L32","v":0}]
[null,null,"Asfaltutlegger",{"$f":"('Transport og energibehov'!D48*1000)/D5","v":12.01923076923077},{"$f":"('Transport og energibehov'!D33/D14)*'Transport og energibehov'!N33","v":0.23212799999999997},{"$f":"('Transport og energibehov'!D33/D14)*'Transport og energibehov'!M33","v":1.7472000000000001E-2},{"$f":"('Transport og energibehov'!H33/D14)*'Transport og energibehov'!L33","v":0}]
[null,"Forsterkningslag","Gravemaskin",{"$f":"('Transport og energibehov'!D49*1000)/D6","v":215.05376344086022},{"$f":"('Transport og energibehov'!D34/D15)*'Transport og energibehov'!N34","v":8.6489999999999997E-2},{"$f":"('Transport og energibehov'!D34/D15)*'Transport og energibehov'!M34","v":6.5100000000000002E-3},{"$f":"('Transport og energibehov'!H34/D15)*'Transport og energibehov'!L34","v":0}]
[null,null,"Grovknuser",{"$f":"('Transport og energibehov'!D50*1000)/D6","v":179.21146953405017},{"$f":"('Transport og energibehov'!D35/D16)*'Transport og energibehov'!N35","v":0.12973500000000002},{"$f":"('Transport og energibehov'!D35/D16)*'Transport og energibehov'!M35","v":9.7650000000000011E-3},{"$f":"('Transport og energibehov'!H35/D16)*'Transport og energibehov'!L35","v":0}]

{"sheet":"Tillegg vei","index":12,"n_rows":14,"n_cols":8,"rows_kept":14,"cut":false,"hidden":false,"merged":[[8,1,8,7],[1,1,1,7],[2,4,2,6],[13,6,13,7],[9,3,9,5],[9,6,9,7],[10,6,10,7],[11,6,11,7],[12,6,12,7]]}
[]
[null,"Materialer og transport "]
[null,"Kategori","Materialtype","Materialmengder","Energiforbruk",null,null,"Kommentar"]
[null,null,null,"Masse per veistrekning\n[kg/m]","Mengde diesel\n[liter/m]","Mengde bio \n[liter/m]","Mengde el\n[kWh/m]"]
[null,"Lyktestolper hovedstrekning","Stål",{"$f":"Beregningsfaktorer!D73*Beregningsfaktorer!D74/1000","v":4.8237500000000004},{"$f":"(D5/1000)*'Transport og energibehov'!D25*'Transport og energibehov'!D11*'Transport og energibehov'!N25","v":3.5888700000000003E-2},{"$f":"(D5/1000)*'Transport og energibehov'!D25*'Transport og energibehov'!D11*'Transport og energibehov'!M25","v":2.7013000000000007E-3},{"$f":"(D5/1000)*'Transport og energibehov'!H24*'Transport og energibehov'!D11*'Transport og energibehov'!L25","v":0},"Bare for hovedvei i dagen og bru. Per belysningsrekke. "]
[null,"Lyktestolper sidevei","Stål",{"$f":"Beregningsfaktorer!D73*Beregningsfaktorer!D75/1000","v":4.8237500000000004},{"$f":"(D6/1000)*'Transport og energibehov'!D25*'Transport og energibehov'!D11*'Transport og energibehov'!N25","v":3.5888700000000003E-2},{"$f":"(D6/1000)*'Transport og energibehov'!D25*'Transport og energibehov'!D11*'Transport og energibehov'!M25","v":2.7013000000000007E-3},{"$f":"(D6/1000)*'Transport og energibehov'!H24*'Transport og energibehov'!D11*'Transport og energibehov'!L25","v":0},"Bare for sidevei i dagen. Per belysningsrekke. "]
[null,"Autovern/rekkverk","Stål",{"$f":"Beregningsfaktorer!D76","v":16.5},{"$f":"(D7/1000)*'Transport og energibehov'!D25*'Transport og energibehov'!D11*'Transport og energibehov'!N25","v":0.12275999999999999},{"$f":"(D7/1000)*'Transport og energibehov'!D25*'Transport og energibehov'!D11*'Transport og energibehov'!M25","v":9.2400000000000017E-3},{"$f":"(D7/1000)*'Transport og energibehov'!H24*'Transport og energibehov'!D11*'Transport og energibehov'!L25","v":0}]
[]
[null,"Anleggsarbeid"]
[null,"Kategori","Maskintype","Energiforbruk",null,null,"Kommentar"]
[null,null,null,"Mengde diesel\n[liter/m]","Mengde bio\n[liter/m]","Mengde el\n[kWh/m]"]
[null,"Montering av autovern/rekkverk","Pelerigg/lastebil",{"$f":"'Transport og energibehov'!D40*'Transport og energibehov'!N40","v":0.372},{"$f":"'Transport og energibehov'!D40*'Transport og energibehov'!M40","v":2.8000000000000004E-2},{"$f":"'Transport og energibehov'!H40*'Transport og energibehov'!L40","v":0},"I beregning av klimagassutslipp antas det fire rekkverk på firefeltsvei og to rekkverk på tofeltsvei"]
[null,"Veimerking","Formerkebil (pickup)",{"$f":"'Transport og energibehov'!D38*'Transport og energibehov'!N38","v":5.4869999999999997E-3},{"$f":"'Transport og energibehov'!D38*'Transport og energibehov'!M38","v":4.1300000000000001E-4},{"$f":"'Transport og energibehov'!H38*'Transport og energibehov'!L38","v":0}]
[null,"Etablering av grøft","Gravemaskin",{"$f":"'Transport og energibehov'!D39*'Transport og energibehov'!N39","v":37.199999999999996},{"$f":"'Transport og energibehov'!D39*'Transport og energibehov'!M39","v":2.8000000000000003},{"$f":"'Transport og energibehov'!H39*'Transport og energibehov'!L39","v":0}]

{"sheet":"Tunnel enkeltløp","index":13,"n_rows":37,"n_cols":11,"rows_kept":37,"cut":false,"hidden":false,"merged":[[7,3,7,5],[7,7,7,9],[6,1,6,10],[30,12,33,12],[20,1,20,7],[21,3,21,6]]}
[null,"Tunnel enkeltløp"]
[null,"Bakgrunnsdata"]
[null,"Samlet lengde enkeltløpstunneler [m]",{"$f":"Beregninger!C88","v":0},"(Hentes fra inndataark/beregninger)"]
[null,"Antall enkeltløpstunneler",{"$f":"'Prosjektbeskrivelse og inndata'!C6","v":0}]
[null,"Tunnelprofil",{"$f":"Beregningsfaktorer!D41","v":10.5}]
[]
[null,"Materialer og transport"]
[null,"Kategori","Materialtype","Materialmengder",null,null,null,"Transport",null,null,"Kommentar"]
[null,null,null,"Volum per areal\n[m3/m2]","Masse per areal\n[kg/m2]","Mengde material\n[kg/m]","Mengde material\n[m2/m]","Mengde diesel\n[liter/m]","Mengde bio \n[liter/m]","Mengde el\n[kWh/m]"]
[null,"Konstruksjon","Betongportal",{"$f":"IFERROR((Beregningsfaktorer!D43*2*C4)/(Beregningsfaktorer!D41*'Tunnel enkeltløp'!C3),0)","v":0},{"$f":"D10*Beregningsfaktorer!D4","v":0},{"$f":"E10*Beregningsfaktorer!D41","v":0},null,{"$f":"(F10/1000)*'Transport og energibehov'!D24*'Transport og energibehov'!D10*'Transport og energibehov'!N24","v":0},{"$f":"(F10/1000)*'Transport og energibehov'!D24*'Transport og energibehov'!D10*'Transport og energibehov'!M24","v":0},{"$f":"(F10/1000)*'Transport og energibehov'!H24*'Transport og energibehov'!D10*'Transport og energibehov'!L24","v":0}]
[null,null,"Armering portal",null,{"$f":"IFERROR((Beregningsfaktorer!D45*2*C4)/(Beregningsfaktorer!D41*'Tunnel enkeltløp'!C3),0)","v":0},{"$f":"E11*Beregningsfaktorer!D41","v":0},null,{"$f":"(F11/1000)*'Transport og energibehov'!D26*'Transport og energibehov'!D12*'Transport og energibehov'!N26","v":0},{"$f":"(F11/1000)*'Transport og energibehov'!D26*'Transport og energibehov'!D12*'Transport og energibehov'!M26","v":0},{"$f":"(F11/1000)*'Transport og energibehov'!H26*'Transport og energibehov'!D12*'Transport og energibehov'!L26","v":0}]
[null,null,"Sikringsbolter",null,{"$f":"Beregningsfaktorer!D32/Beregningsfaktorer!D41","v":4.1904761904761907},{"$f":"Beregningsfaktorer!D32*(Beregningsfaktorer!D41/9.5)","v":48.631578947368425},null,{"$f":"(F12/1000)*'Transport og energibehov'!D25*'Transport og energibehov'!D11*'Transport og energibehov'!N25","v":0.36181894736842102},{"$f":"(F12/1000)*'Transport og energibehov'!D25*'Transport og energibehov'!D11*'Transport og energibehov'!M25","v":2.723368421052632E-2},{"$f":"(F12/1000)*'Transport og energibehov'!H25*'Transport og energibehov'!D11*'Transport og energibehov'!L25","v":0},"Beregning hentet fra metoderapport"]
[null,null,"Frostsikring hvelv",null,{"$f":"(VLOOKUP(C5,Beregningsfaktorer!M42:S52,3,FALSE)*Beregningsfaktorer!D12*Beregningsfaktorer!D25)/C5","v":762.43119047619052},{"$f":"E13*C5","v":8005.5275000000001},{"$f":"VLOOKUP(C5,Beregningsfaktorer!M42:S52,3,FALSE)","v":22.13},{"$f":"(F13/1000)*'Transport og energibehov'!D28*'Transport og energibehov'!D14*'Transport og energibehov'!N28","v":10.423196804999998},{"$f":"(F13/1000)*'Transport og energibehov'!D28*'Transport og energibehov'!D14*'Transport og energibehov'!M28","v":0.78454169500000004},{"$f":"(F13/1000)*'Transport og energibehov'!D28*'Transport og energibehov'!D14*'Transport og energibehov'!L28","v":0}]
[null,"Veioverbygning","Slitelag (Ska)",{"$f":"Beregningsfaktorer!D19","v":4.4999999999999998E-2},{"$f":"Beregningsfaktorer!D7*D14","v":112.5},{"$f":"E14*Beregningsfaktorer!D41","v":1181.25},null,{"$f":"(F14/1000)*'Transport og energibehov'!D20*'Transport og energibehov'!D7*'Transport og energibehov'!N20","v":0.65913749999999993},{"$f":"(F14/1000)*'Transport og energibehov'!D20*'Transport og energibehov'!D7*'Transport og energibehov'!M20","v":4.9612500000000004E-2},{"$f":"(F14/1000)*'Transport og energibehov'!H20*'Transport og energibehov'!D7*'Transport og energibehov'!L20","v":0}]
[null,null,"Bindlag (Ska)",{"$f":"Beregningsfaktorer!D20","v":3.5000000000000003E-2},{"$f":"Beregningsfaktorer!D7*D15","v":87.500000000000014},{"$f":"E15*Beregningsfaktorer!D41","v":918.75000000000011},null,{"$f":"(F15/1000)*'Transport og energibehov'!D20*'Transport og energibehov'!D7*'Transport og energibehov'!N20","v":0.51266250000000002},{"$f":"(F15/1000)*'Transport og energibehov'!D20*'Transport og energibehov'!D7*'Transport og energibehov'!M20","v":3.8587500000000004E-2},{"$f":"(F15/1000)*'Transport og energibehov'!H20*'Transport og energibehov'!D7*'Transport og energibehov'!L20","v":0}]
[null,null,"Bærelag (Ag)",{"$f":"Beregningsfaktorer!D21","v":0.13},{"$f":"Beregningsfaktorer!D8*D16","v":312},{"$f":"E16*Beregningsfaktorer!D41","v":3276},null,{"$f":"(F16/1000)*'Transport og energibehov'!D21*'Transport og energibehov'!D8*'Transport og energibehov'!N21","v":1.8280079999999996},{"$f":"(F16/1000)*'Transport og energibehov'!D21*'Transport og energibehov'!D8*'Transport og energibehov'!M21","v":0.13759199999999999},{"$f":"(F16/1000)*'Transport og energibehov'!H21*'Transport og energibehov'!D8*'Transport og energibehov'!L21","v":0}]
[null,null,"Forsterkningslag",{"$f":"Beregningsfaktorer!D22","v":0.45},{"$f":"Beregningsfaktorer!D10*D17","v":697.5},{"$f":"E17*Beregningsfaktorer!D41","v":7323.75},null,{"$f":"(F17/1000)*'Transport og energibehov'!D22*'Transport og energibehov'!D9*'Transport og energibehov'!N22","v":2.0433262500000002},{"$f":"(F17/1000)*'Transport og energibehov'!D22*'Transport og energibehov'!D9*'Transport og energibehov'!M22","v":0.15379875000000004},{"$f":"(F17/1000)*'Transport og energibehov'!H22*'Transport og energibehov'!D9*'Transport og energibehov'!L22","v":0}]
[null,null,"Frostsikringslag",{"$f":"Beregningsfaktorer!D23","v":1.74},{"$f":"Beregningsfaktorer!D9*D18","v":2697},{"$f":"E18*Beregningsfaktorer!D41","v":28318.5},null,{"$f":"(F18/1000)*'Transport og energibehov'!D22*'Transport og energibehov'!D9*'Transport og energibehov'!N22","v":7.9008615000000004},{"$f":"(F18/1000)*'Transport og energibehov'!D22*'Transport og energibehov'!D9*'Transport og energibehov'!M22","v":0.59468850000000018},{"$f":"(F18/1000)*'Transport og energibehov'!H22*'Transport og energibehov'!D9*'Transport og energibehov'!L22","v":0}]
[]
[]
[null,"Anleggsarbeid"]
[null,"Kategori","Maskintype","Anleggsarbeid",null,null,null,"Kommentar"]
[null,null,null,"Anleggsarbeid\n[m2/time]","Mengde diesel \n[liter/m2]","Mengde bio\n[liter/m2]","Mengde el\n[kWh/m2]"]
[null,"Slitelag","Veivals",{"$f":"('Transport og energibehov'!D46*1000)/E14","v":666.66666666666663},{"$f":"('Transport og energibehov'!D31/D24)*'Transport og energibehov'!N31","v":4.1850000000000004E-3},{"$f":"('Transport og energibehov'!D31/D24)*'Transport og energibehov'!M31","v":3.1500000000000007E-4},{"$f":"('Transport og energibehov'!H31/D24)*'Transport og energibehov'!L31","v":0}]
[null,null,"Traktor",{"$f":"('Transport og energibehov'!D47*1000)/E14","v":2666.6666666666665},{"$f":"('Transport og energibehov'!D32/D25)*'Transport og energibehov'!N32","v":1.7437500000000001E-3},{"$f":"('Transport og energibehov'!D32/D25)*'Transport og energibehov'!M32","v":1.3125000000000002E-4},{"$f":"('Transport og energibehov'!H32/D25)*'Transport og energibehov'!L32","v":0}]
[null,null,"Asfaltutlegger",{"$f":"('Transport og energibehov'!D48*1000)/E14","v":33.333333333333336},{"$f":"('Transport og energibehov'!D33/D26)*'Transport og energibehov'!N33","v":8.3699999999999997E-2},{"$f":"('Transport og energibehov'!D33/D26)*'Transport og energibehov'!M33","v":6.3E-3},{"$f":"('Transport og energibehov'!H33/D26)*'Transport og energibehov'!L33","v":0}]
[null,"Bindlag","Veivals",{"$f":"('Transport og energibehov'!D46*1000)/E15","v":857.142857142857},{"$f":"('Transport og energibehov'!D31/D27)*'Transport og energibehov'!N31","v":3.2550000000000001E-3},{"$f":"('Transport og energibehov'!D31/D27)*'Transport og energibehov'!M31","v":2.4500000000000005E-4},{"$f":"('Transport og energibehov'!H31/D27)*'Transport og energibehov'!L31","v":0}]
[null,null,"Traktor",{"$f":"('Transport og energibehov'!D47*1000)/E15","v":3428.571428571428},{"$f":"('Transport og energibehov'!D32/D28)*'Transport og energibehov'!N32","v":1.3562500000000003E-3},{"$f":"('Transport og energibehov'!D32/D28)*'Transport og energibehov'!M32","v":1.0208333333333337E-4},{"$f":"('Transport og energibehov'!H32/D28)*'Transport og energibehov'!L32","v":0}]
[null,null,"Asfaltutlegger",{"$f":"('Transport og energibehov'!D48*1000)/E15","v":42.857142857142847},{"$f":"('Transport og energibehov'!D33/D29)*'Transport og energibehov'!N33","v":6.5100000000000019E-2},{"$f":"('Transport og energibehov'!D33/D29)*'Transport og energibehov'!M33","v":4.9000000000000016E-3},{"$f":"('Transport og energibehov'!H33/D29)*'Transport og energibehov'!L33","v":0}]
[null,"Bærelag","Veivals",{"$f":"('Transport og energibehov'!D46*1000)/E16","v":240.38461538461539},{"$f":"('Transport og energibehov'!D31/D30)*'Transport og energibehov'!N31","v":1.1606399999999999E-2},{"$f":"('Transport og energibehov'!D31/D30)*'Transport og energibehov'!M31","v":8.7360000000000009E-4},{"$f":"('Transport og energibehov'!H31/D30)*'Transport og energibehov'!L31","v":0}]
[null,null,"Traktor",{"$f":"('Transport og energibehov'!D47*1000)/E16","v":961.53846153846155},{"$f":"('Transport og energibehov'!D32/D31)*'Transport og energibehov'!N32","v":4.8359999999999992E-3},{"$f":"('Transport og energibehov'!D32/D31)*'Transport og energibehov'!M32","v":3.6400000000000001E-4},{"$f":"('Transport og energibehov'!H32/D31)*'Transport og energibehov'!L32","v":0}]
[null,null,"Asfaltutlegger",{"$f":"('Transport og energibehov'!D48*1000)/E16","v":12.01923076923077},{"$f":"('Transport og energibehov'!D33/D32)*'Transport og energibehov'!N33","v":0.23212799999999997},{"$f":"('Transport og energibehov'!D33/D32)*'Transport og energibehov'!M33","v":1.7472000000000001E-2},{"$f":"('Transport og energibehov'!H33/D32)*'Transport og energibehov'!L33","v":0}]
[null,"Forsterkningslag","Gravemaskin",{"$f":"('Transport og energibehov'!D49*1000)/E17","v":215.05376344086022},{"$f":"('Transport og energibehov'!D34/D33)*'Transport og energibehov'!N34","v":8.6489999999999997E-2},{"$f":"('Transport og energibehov'!D34/D33)*'Transport og energibehov'!M34","v":6.5100000000000002E-3},{"$f":"('Transport og energibehov'!H34/D33)*'Transport og energibehov'!L34","v":0}]
[null,null,"Grovknuser",{"$f":"('Transport og energibehov'!D50*1000)/E17","v":179.21146953405017},{"$f":"('Transport og energibehov'!D35/D34)*'Transport og energibehov'!N35","v":0.12973500000000002},{"$f":"('Transport og energibehov'!D35/D34)*'Transport og energibehov'!M35","v":9.7650000000000011E-3},{"$f":"('Transport og energibehov'!H35/D34)*'Transport og energibehov'!L35","v":0}]
[null,"Frostsikringslag","Gravemaskin",{"$f":"('Transport og energibehov'!D49*1000)/E18","v":55.617352614015573},{"$f":"('Transport og energibehov'!D34/D35)*'Transport og energibehov'!N34","v":0.33442799999999995},{"$f":"('Transport og energibehov'!D34/D35)*'Transport og energibehov'!M34","v":2.5172E-2},{"$f":"('Transport og energibehov'!H34/D35)*'Transport og energibehov'!L34","v":0}]
[null,null,"Grovknuser",{"$f":"('Transport og energibehov'!D50*1000)/E18","v":46.34779384501298},{"$f":"('Transport og energibehov'!D35/D36)*'Transport og energibehov'!N35","v":0.50164199999999992},{"$f":"('Transport og energibehov'!D35/D36)*'Transport og energibehov'!M35","v":3.7758E-2},{"$f":"('Transport og energibehov'!H35/D36)*'Transport og energibehov'!L35","v":0}]
[null,null,"Finknuser",{"$f":"('Transport og energibehov'!D51*1000)/E18","v":92.69558769002596},{"$f":"('Transport og energibehov'!D36/D37)*'Transport og energibehov'!N36","v":0.25082099999999996},{"$f":"('Transport og energibehov'!D36/D37)*'Transport og energibehov'!M36","v":1.8879E-2},{"$f":"('Transport og energibehov'!H36/D37)*'Transport og energibehov'!L36","v":0}]

{"sheet":"Tunnel dobbeltløp","index":14,"n_rows":37,"n_cols":11,"rows_kept":37,"cut":false,"hidden":false,"merged":[[30,12,33,12],[6,1,6,10],[7,3,7,5],[7,7,7,9],[20,1,20,7],[21,3,21,6]]}
[null,"Tunnel dobbeltløp"]
[null,"Bakgrunnsdata"]
[null,"Samlet lengde dobbeltløpstunneler [m]",{"$f":"Beregninger!C102","v":0},"(Hentes fra inndataark/beregninger)"]
[null,"Antall dobbeltløpstunneler",{"$f":"'Prosjektbeskrivelse og inndata'!C7","v":0}]
[null,"Tunnelprofil",{"$f":"Beregningsfaktorer!D42","v":9.5}]
[]
[null,"Materialer og transport"]
[null,"Kategori","Materialtype","Materialmengder",null,null,null,"Transport",null,null,"Kommentar"]
[null,null,null,"Volum per areal\n[m3/m2]","Masse per areal\n[kg/m2]","Mengde material\n[kg/m]","Mengde material\n[m2/m]","Mengde diesel\n[liter/m]","Mengde bio \n[liter/m]","Mengde el\n[kWh/m]"]
[null,"Konstruksjon","Betongportal",{"$f":"IFERROR((Beregningsfaktorer!D44*2*C4)/(Beregningsfaktorer!D42*C3),0)","v":0},{"$f":"D10*Beregningsfaktorer!D4","v":0},{"$f":"E10*Beregningsfaktorer!D42","v":0},null,{"$f":"(F10/1000)*'Transport og energibehov'!D24*'Transport og energibehov'!D10*'Transport og energibehov'!N24","v":0},{"$f":"(F10/1000)*'Transport og energibehov'!D24*'Transport og energibehov'!D10*'Transport og energibehov'!M24","v":0},{"$f":"(F10/1000)*'Transport og energibehov'!H24*'Transport og energibehov'!D10*'Transport og energibehov'!L24","v":0}]
[null,null,"Armering portal",null,{"$f":"IFERROR((Beregningsfaktorer!D46*2*C4)/(Beregningsfaktorer!D42*C3),0)","v":0},{"$f":"E11*Beregningsfaktorer!D42","v":0},null,{"$f":"(F11/1000)*'Transport og energibehov'!D26*'Transport og energibehov'!D12*'Transport og energibehov'!N26","v":0},{"$f":"(F11/1000)*'Transport og energibehov'!D26*'Transport og energibehov'!D12*'Transport og energibehov'!M26","v":0},{"$f":"(F11/1000)*'Transport og energibehov'!H26*'Transport og energibehov'!D12*'Transport og energibehov'!L26","v":0}]
[null,null,"Sikringsbolter",null,{"$f":"Beregningsfaktorer!D32/Beregningsfaktorer!D42","v":4.6315789473684212},{"$f":"Beregningsfaktorer!D32*(Beregningsfaktorer!D42/9.5)","v":44},null,{"$f":"(F12/1000)*'Transport og energibehov'!D25*'Transport og energibehov'!D11*'Transport og energibehov'!N25","v":0.32735999999999998},{"$f":"(F12/1000)*'Transport og energibehov'!D25*'Transport og energibehov'!D11*'Transport og energibehov'!M25","v":2.4640000000000002E-2},{"$f":"(F12/1000)*'Transport og energibehov'!H25*'Transport og energibehov'!D11*'Transport og energibehov'!L25","v":0},"Beregning hentet fra metoderapport"]
[null,null,"Frostsikring hvelv",null,{"$f":"(VLOOKUP(C5,Beregningsfaktorer!M42:S52,3,FALSE)*Beregningsfaktorer!D12*Beregningsfaktorer!D25)/C5","v":801.18105263157895},{"$f":"E13*C5","v":7611.22},{"$f":"(VLOOKUP(C5,Beregningsfaktorer!M42:S52,3,FALSE))","v":21.04},{"$f":"(F13/1000)*'Transport og energibehov'!D28*'Transport og energibehov'!D14*'Transport og energibehov'!N28","v":9.9098084399999991},{"$f":"(F13/1000)*'Transport og energibehov'!D28*'Transport og energibehov'!D14*'Transport og energibehov'!M28","v":0.74589956000000013},{"$f":"(F13/1000)*'Transport og energibehov'!D28*'Transport og energibehov'!D14*'Transport og energibehov'!L28","v":0}]
[null,"Veioverbygning","Slitelag (Ska)",{"$f":"Beregningsfaktorer!D19","v":4.4999999999999998E-2},{"$f":"Beregningsfaktorer!D7*D14","v":112.5},{"$f":"E14*Beregningsfaktorer!D42","v":1068.75},null,{"$f":"(F14/1000)*'Transport og energibehov'!D20*'Transport og energibehov'!D7*'Transport og energibehov'!N20","v":0.59636250000000002},{"$f":"(F14/1000)*'Transport og energibehov'!D20*'Transport og energibehov'!D7*'Transport og energibehov'!M20","v":4.4887500000000011E-2},{"$f":"(F14/1000)*'Transport og energibehov'!H20*'Transport og energibehov'!D7*'Transport og energibehov'!L20","v":0}]
[null,null,"Bindlag (Ska)",{"$f":"Beregningsfaktorer!D20","v":3.5000000000000003E-2},{"$f":"Beregningsfaktorer!D7*D15","v":87.500000000000014},{"$f":"E15*Beregningsfaktorer!D42","v":831.25000000000011},null,{"$f":"(F15/1000)*'Transport og energibehov'!D20*'Transport og energibehov'!D7*'Transport og energibehov'!N20","v":0.46383750000000012},{"$f":"(F15/1000)*'Transport og energibehov'!D20*'Transport og energibehov'!D7*'Transport og energibehov'!M20","v":3.4912500000000013E-2},{"$f":"(F15/1000)*'Transport og energibehov'!H20*'Transport og energibehov'!D7*'Transport og energibehov'!L20","v":0}]
[null,null,"Bærelag (Ag)",{"$f":"Beregningsfaktorer!D21","v":0.13},{"$f":"Beregningsfaktorer!D8*D16","v":312},{"$f":"E16*Beregningsfaktorer!D42","v":2964},null,{"$f":"(F16/1000)*'Transport og energibehov'!D21*'Transport og energibehov'!D8*'Transport og energibehov'!N21","v":1.6539119999999998},{"$f":"(F16/1000)*'Transport og energibehov'!D21*'Transport og energibehov'!D8*'Transport og energibehov'!M21","v":0.12448800000000002},{"$f":"(F16/1000)*'Transport og energibehov'!H21*'Transport og energibehov'!D8*'Transport og energibehov'!L21","v":0}]
[null,null,"Forsterkningslag",{"$f":"Beregningsfaktorer!D22","v":0.45},{"$f":"Beregningsfaktorer!D10*D17","v":697.5},{"$f":"E17*Beregningsfaktorer!D42","v":6626.25},null,{"$f":"(F17/1000)*'Transport og energibehov'!D22*'Transport og energibehov'!D9*'Transport og energibehov'!N22","v":1.84872375},{"$f":"(F17/1000)*'Transport og energibehov'!D22*'Transport og energibehov'!D9*'Transport og energibehov'!M22","v":0.13915125},{"$f":"(F17/1000)*'Transport og energibehov'!H22*'Transport og energibehov'!D9*'Transport og energibehov'!L22","v":0}]
[null,null,"Frostsikringslag",{"$f":"Beregningsfaktorer!D23","v":1.74},{"$f":"Beregningsfaktorer!D9*D18","v":2697},{"$f":"E18*Beregningsfaktorer!D42","v":25621.5},null,{"$f":"(F18/1000)*'Transport og energibehov'!D22*'Transport og energibehov'!D9*'Transport og energibehov'!N22","v":7.1483984999999999},{"$f":"(F18/1000)*'Transport og energibehov'!D22*'Transport og energibehov'!D9*'Transport og energibehov'!M22","v":0.53805150000000013},{"$f":"(F18/1000)*'Transport og energibehov'!H22*'Transport og energibehov'!D9*'Transport og energibehov'!L22","v":0}]
[]
[]
[null,"Anleggsarbeid"]
[null,"Kategori","Maskintype","Anleggsarbeid",null,null,null,"Kommentar"]
[null,null,null,"Anleggsarbeid\n[m2/time]","Mengde diesel \n[liter/m2]","Mengde bio\n[liter/m2]","Mengde el\n[kWh/m2]"]
[null,"Slitelag","Veivals",{"$f":"('Transport og energibehov'!D46*1000)/E14","v":666.66666666666663},{"$f":"('Transport og energibehov'!D31/D24)*'Transport og energibehov'!N31","v":4.1850000000000004E-3},{"$f":"('Transport og energibehov'!D31/D24)*'Transport og energibehov'!M31","v":3.1500000000000007E-4},{"$f":"('Transport og energibehov'!H31/D24)*'Transport og energibehov'!L31","v":0}]
[null,null,"Traktor",{"$f":"('Transport og energibehov'!D47*1000)/E14","v":2666.6666666666665},{"$f":"('Transport og energibehov'!D32/D25)*'Transport og energibehov'!N32","v":1.7437500000000001E-3},{"$f":"('Transport og energibehov'!D32/D25)*'Transport og energibehov'!M32","v":1.3125000000000002E-4},{"$f":"('Transport og energibehov'!H32/D25)*'Transport og energibehov'!L32","v":0}]
[null,null,"Asfaltutlegger",{"$f":"('Transport og energibehov'!D48*1000)/E14","v":33.333333333333336},{"$f":"('Transport og energibehov'!D33/D26)*'Transport og energibehov'!N33","v":8.3699999999999997E-2},{"$f":"('Transport og energibehov'!D33/D26)*'Transport og energibehov'!M33","v":6.3E-3},{"$f":"('Transport og energibehov'!H33/D26)*'Transport og energibehov'!L33","v":0}]
[null,"Bindlag","Veivals",{"$f":"('Transport og energibehov'!D46*1000)/E15","v":857.142857142857},{"$f":"('Transport og energibehov'!D31/D27)*'Transport og energibehov'!N31","v":3.2550000000000001E-3},{"$f":"('Transport og energibehov'!D31/D27)*'Transport og energibehov'!M31","v":2.4500000000000005E-4},{"$f":"('Transport og energibehov'!H31/D27)*'Transport og energibehov'!L31","v":0}]
[null,null,"Traktor",{"$f":"('Transport og energibehov'!D47*1000)/E15","v":3428.571428571428},{"$f":"('Transport og energibehov'!D32/D28)*'Transport og energibehov'!N32","v":1.3562500000000003E-3},{"$f":"('Transport og energibehov'!D32/D28)*'Transport og energibehov'!M32","v":1.0208333333333337E-4},{"$f":"('Transport og energibehov'!H32/D28)*'Transport og energibehov'!L32","v":0}]
[null,null,"Asfaltutlegger",{"$f":"('Transport og energibehov'!D48*1000)/E15","v":42.857142857142847},{"$f":"('Transport og energibehov'!D33/D29)*'Transport og energibehov'!N33","v":6.5100000000000019E-2},{"$f":"('Transport og energibehov'!D33/D29)*'Transport og energibehov'!M33","v":4.9000000000000016E-3},{"$f":"('Transport og energibehov'!H33/D29)*'Transport og energibehov'!L33","v":0}]
[null,"Bærelag","Veivals",{"$f":"('Transport og energibehov'!D46*1000)/E16","v":240.38461538461539},{"$f":"('Transport og energibehov'!D31/D30)*'Transport og energibehov'!N31","v":1.1606399999999999E-2},{"$f":"('Transport og energibehov'!D31/D30)*'Transport og energibehov'!M31","v":8.7360000000000009E-4},{"$f":"('Transport og energibehov'!H31/D30)*'Transport og energibehov'!L31","v":0}]
[null,null,"Traktor",{"$f":"('Transport og energibehov'!D47*1000)/E16","v":961.53846153846155},{"$f":"('Transport og energibehov'!D32/D31)*'Transport og energibehov'!N32","v":4.8359999999999992E-3},{"$f":"('Transport og energibehov'!D32/D31)*'Transport og energibehov'!M32","v":3.6400000000000001E-4},{"$f":"('Transport og energibehov'!H32/D31)*'Transport og energibehov'!L32","v":0}]
[null,null,"Asfaltutlegger",{"$f":"('Transport og energibehov'!D48*1000)/E16","v":12.01923076923077},{"$f":"('Transport og energibehov'!D33/D32)*'Transport og energibehov'!N33","v":0.23212799999999997},{"$f":"('Transport og energibehov'!D33/D32)*'Transport og energibehov'!M33","v":1.7472000000000001E-2},{"$f":"('Transport og energibehov'!H33/D32)*'Transport og energibehov'!L33","v":0}]
[null,"Forsterkningslag","Gravemaskin",{"$f":"('Transport og energibehov'!D49*1000)/E17","v":215.05376344086022},{"$f":"('Transport og energibehov'!D34/D33)*'Transport og energibehov'!N34","v":8.6489999999999997E-2},{"$f":"('Transport og energibehov'!D34/D33)*'Transport og energibehov'!M34","v":6.5100000000000002E-3},{"$f":"('Transport og energibehov'!H34/D33)*'Transport og energibehov'!L34","v":0}]
[null,null,"Grovknuser",{"$f":"('Transport og energibehov'!D50*1000)/E17","v":179.21146953405017},{"$f":"('Transport og energibehov'!D35/D34)*'Transport og energibehov'!N35","v":0.12973500000000002},{"$f":"('Transport og energibehov'!D35/D34)*'Transport og energibehov'!M35","v":9.7650000000000011E-3},{"$f":"('Transport og energibehov'!H35/D34)*'Transport og energibehov'!L35","v":0}]
[null,"Frostsikringslag","Gravemaskin",{"$f":"('Transport og energibehov'!D49*1000)/E18","v":55.617352614015573},{"$f":"('Transport og energibehov'!D34/D35)*'Transport og energibehov'!N34","v":0.33442799999999995},{"$f":"('Transport og energibehov'!D34/D35)*'Transport og energibehov'!M34","v":2.5172E-2},{"$f":"('Transport og energibehov'!H34/D35)*'Transport og energibehov'!L34","v":0}]
[null,null,"Grovknuser",{"$f":"('Transport og energibehov'!D50*1000)/E18","v":46.34779384501298},{"$f":"('Transport og energibehov'!D35/D36)*'Transport og energibehov'!N35","v":0.50164199999999992},{"$f":"('Transport og energibehov'!D35/D36)*'Transport og energibehov'!M35","v":3.7758E-2},{"$f":"('Transport og energibehov'!H35/D36)*'Transport og energibehov'!L35","v":0}]
[null,null,"Finknuser",{"$f":"('Transport og energibehov'!D51*1000)/E18","v":92.69558769002596},{"$f":"('Transport og energibehov'!D36/D37)*'Transport og energibehov'!N36","v":0.25082099999999996},{"$f":"('Transport og energibehov'!D36/D37)*'Transport og energibehov'!M36","v":1.8879E-2},{"$f":"('Transport og energibehov'!H36/D37)*'Transport og energibehov'!L36","v":0}]

{"sheet":"Betongbru","index":15,"n_rows":26,"n_cols":9,"rows_kept":26,"cut":false,"hidden":false,"merged":[[2,3,2,4],[11,1,11,7],[12,3,12,6],[2,5,2,7],[1,1,1,8]]}
[]
[null,"Materialer og transport"]
[null,"Kategori","Materialtype","Materialmengder",null,"Transport",null,null,"Kommentar"]
[null,null,null,"Volum per areal\n[m3/m2]","Masse per areal\n[kg/m2]","Mengde diesel\n[liter/m2]","Mengde bio \n[liter/m2]","Mengde el\n[kWh/m2]"]
[null,"Konstruksjon","Betong",{"$f":"Beregningsfaktorer!D26","v":1.29},{"$f":"Beregningsfaktorer!D4*D5","v":3096},{"$f":"(E5/1000)*'Transport og energibehov'!D24*'Transport og energibehov'!D10*'Transport og energibehov'!N24","v":2.3034239999999997},{"$f":"(E5/1000)*'Transport og energibehov'!D24*'Transport og energibehov'!D10*'Transport og energibehov'!M24","v":0.173376},{"$f":"(E5/1000)*'Transport og energibehov'!H24*'Transport og energibehov'!D10*'Transport og energibehov'!L24","v":0}]
[null,null,"Armeringsstål",null,{"$f":"Beregningsfaktorer!D28","v":231},{"$f":"(E6/1000)*'Transport og energibehov'!D26*'Transport og energibehov'!D12*'Transport og energibehov'!N26","v":1.7186399999999999},{"$f":"(E6/1000)*'Transport og energibehov'!D26*'Transport og energibehov'!D12*'Transport og energibehov'!M26","v":0.12936000000000003},{"$f":"(E6/1000)*'Transport og energibehov'!H26*'Transport og energibehov'!D12*'Transport og energibehov'!L26","v":0}]
[null,"Veioverbygning","Slitelag (Ska)",{"$f":"Beregningsfaktorer!D19","v":4.4999999999999998E-2},{"$f":"D7*Beregningsfaktorer!D7","v":112.5},{"$f":"(E7/1000)*'Transport og energibehov'!D20*'Transport og energibehov'!D7*'Transport og energibehov'!N20","v":6.2774999999999997E-2},{"$f":"(E7/1000)*'Transport og energibehov'!D20*'Transport og energibehov'!D7*'Transport og energibehov'!M20","v":4.7250000000000009E-3},{"$f":"(E7/1000)*'Transport og energibehov'!H20*'Transport og energibehov'!D7*'Transport og energibehov'!L20","v":0}]
[null,null,"Bindlag (Ska)",{"$f":"Beregningsfaktorer!D20","v":3.5000000000000003E-2},{"$f":"D8*Beregningsfaktorer!D7","v":87.500000000000014},{"$f":"(E8/1000)*'Transport og energibehov'!D20*'Transport og energibehov'!D7*'Transport og energibehov'!N20","v":4.8825E-2},{"$f":"(E8/1000)*'Transport og energibehov'!D20*'Transport og energibehov'!D7*'Transport og energibehov'!M20","v":3.6750000000000007E-3},{"$f":"(E8/1000)*'Transport og energibehov'!H20*'Transport og energibehov'!D7*'Transport og energibehov'!L20","v":0}]
[null,null,"Fuktisolasjon (Topeka)",{"$f":"Beregningsfaktorer!D24","v":1.2E-2},{"$f":"D9*Beregningsfaktorer!D13","v":30},{"$f":"(E9/1000)*'Transport og energibehov'!D27*'Transport og energibehov'!D13*'Transport og energibehov'!N27","v":3.9059999999999991E-2},{"$f":"(E9/1000)*'Transport og energibehov'!D27*'Transport og energibehov'!D13*'Transport og energibehov'!M27","v":2.9399999999999999E-3},{"$f":"(E9/1000)*'Transport og energibehov'!H27*'Transport og energibehov'!D13*'Transport og energibehov'!L27","v":0}]
[]
[]
[null,"Anleggsarbeid"]
[null,"Kategori","Maskintype","Anleggsarbeid",null,null,null,"Kommentar"]
[null,null,null,"Arbeidshastighet\n[m2/time]","Mengde diesel\n[liter/m2]","Mengde bio\n[liter/m2]","Mengde el\n[kWh/m2]"]
[null,"Konstruksjon","Kran første 400 m2",{"$f":"'Transport og energibehov'!D52","v":1.6666666666666667},null,null,{"$f":"('Transport og energibehov'!H37/D15)*'Transport og energibehov'!L37","v":29.16},"Antatt 100 % el"]
[null,null,"Kran resten av bru",{"$f":"'Transport og energibehov'!D53","v":3.3333333333333335},null,null,{"$f":"('Transport og energibehov'!H37/D16)*'Transport og energibehov'!L37","v":14.58},"Antatt 100 % el"]
[null,null,"Gravemaskin",{"$f":"('Transport og energibehov'!D49*1000)/(E5+E6)","v":45.08566275924256},{"$f":"('Transport og energibehov'!D34/D17)*'Transport og energibehov'!N34","v":0.41254799999999997},{"$f":"('Transport og energibehov'!D34/D17)*'Transport og energibehov'!M34","v":3.1052000000000003E-2},{"$f":"('Transport og energibehov'!H34/D17)*'Transport og energibehov'!L34","v":0}]
[null,"Slitelag","Veivals",{"$f":"('Transport og energibehov'!D46*1000)/E7","v":666.66666666666663},{"$f":"('Transport og energibehov'!D31/D18)*'Transport og energibehov'!N31","v":4.1850000000000004E-3},{"$f":"('Transport og energibehov'!D31/D18)*'Transport og energibehov'!M31","v":3.1500000000000007E-4},{"$f":"('Transport og energibehov'!H31/D18)*'Transport og energibehov'!L31","v":0}]
[null,null,"Traktor",{"$f":"('Transport og energibehov'!D47*1000)/E7","v":2666.6666666666665},{"$f":"('Transport og energibehov'!D32/D19)*'Transport og energibehov'!N32","v":1.7437500000000001E-3},{"$f":"('Transport og energibehov'!D32/D19)*'Transport og energibehov'!M32","v":1.3125000000000002E-4},{"$f":"('Transport og energibehov'!H32/D19)*'Transport og energibehov'!L32","v":0}]
[null,null,"Asfaltutlegger",{"$f":"('Transport og energibehov'!D48*1000)/E7","v":33.333333333333336},{"$f":"('Transport og energibehov'!D33/D20)*'Transport og energibehov'!N33","v":8.3699999999999997E-2},{"$f":"('Transport og energibehov'!D33/D20)*'Transport og energibehov'!M33","v":6.3E-3},{"$f":"('Transport og energibehov'!H33/D20)*'Transport og energibehov'!L33","v":0}]
[null,"Bindlag","Veivals",{"$f":"('Transport og energibehov'!D46*1000)/E8","v":857.142857142857},{"$f":"('Transport og energibehov'!D31/D21)*'Transport og energibehov'!N31","v":3.2550000000000001E-3},{"$f":"('Transport og energibehov'!D31/D21)*'Transport og energibehov'!M31","v":2.4500000000000005E-4},{"$f":"('Transport og energibehov'!H31/D21)*'Transport og energibehov'!L31","v":0}]
[null,null,"Traktor",{"$f":"('Transport og energibehov'!D47*1000)/E8","v":3428.571428571428},{"$f":"('Transport og energibehov'!D32/D22)*'Transport og energibehov'!N32","v":1.3562500000000003E-3},{"$f":"('Transport og energibehov'!D32/D22)*'Transport og energibehov'!M32","v":1.0208333333333337E-4},{"$f":"('Transport og energibehov'!H32/D22)*'Transport og energibehov'!L32","v":0}]
[null,null,"Asfaltutlegger",{"$f":"('Transport og energibehov'!D48*1000)/E8","v":42.857142857142847},{"$f":"('Transport og energibehov'!D33/D23)*'Transport og energibehov'!N33","v":6.5100000000000019E-2},{"$f":"('Transport og energibehov'!D33/D23)*'Transport og energibehov'!M33","v":4.9000000000000016E-3},{"$f":"('Transport og energibehov'!H33/D23)*'Transport og energibehov'!L33","v":0}]
[null,"Fuktsikring","Veivals",{"$f":"('Transport og energibehov'!D46*1000)/E9","v":2500},{"$f":"('Transport og energibehov'!D31/D24)*'Transport og energibehov'!N31","v":1.1159999999999998E-3},{"$f":"('Transport og energibehov'!D31/D24)*'Transport og energibehov'!M31","v":8.3999999999999995E-5},{"$f":"('Transport og energibehov'!H31/D24)*'Transport og energibehov'!L31","v":0}]
[null,null,"Traktor",{"$f":"('Transport og energibehov'!D47*1000)/E9","v":10000},{"$f":"('Transport og energibehov'!D32/D25)*'Transport og energibehov'!N32","v":4.6499999999999997E-4},{"$f":"('Transport og energibehov'!D32/D25)*'Transport og energibehov'!M32","v":3.5000000000000004E-5},{"$f":"('Transport og energibehov'!H32/D25)*'Transport og energibehov'!L32","v":0}]
[null,null,"Asfaltutlegger",{"$f":"('Transport og energibehov'!D48*1000)/E9","v":125},{"$f":"('Transport og energibehov'!D33/D26)*'Transport og energibehov'!N33","v":2.232E-2},{"$f":"('Transport og energibehov'!D33/D26)*'Transport og energibehov'!M33","v":1.6800000000000003E-3},{"$f":"('Transport og energibehov'!H33/D26)*'Transport og energibehov'!L33","v":0}]

{"sheet":"Stålbru","index":16,"n_rows":27,"n_cols":9,"rows_kept":27,"cut":false,"hidden":false,"merged":[[2,3,2,4],[12,1,12,7],[13,3,13,6],[2,5,2,7],[1,1,1,8]]}
[]
[null,"Materialer og transport"]
[null,"Kategori","Materialtype","Materialmengder",null,"Transport",null,null,"Kommentar"]
[null,null,null,"Volum per areal\n[m3/m2]","Masse per areal\n[kg/m2]","Mengde diesel\n[liter/m2]","Mengde bio \n[liter/m2]","Mengde el\n[kWh/m2]"]
[null,"Konstruksjon","Betong",{"$f":"Beregningsfaktorer!D27","v":0.74299999999999999},{"$f":"Beregningsfaktorer!D4*D5","v":1783.2},{"$f":"(E5/1000)*'Transport og energibehov'!D24*'Transport og energibehov'!D10*'Transport og energibehov'!N24","v":1.3267008},{"$f":"(E5/1000)*'Transport og energibehov'!D24*'Transport og energibehov'!D10*'Transport og energibehov'!M24","v":9.9859200000000009E-2},{"$f":"(E5/1000)*'Transport og energibehov'!H24*'Transport og energibehov'!D10*'Transport og energibehov'!L24","v":0}]
[null,null,"Armeringsstål",null,{"$f":"Beregningsfaktorer!D29","v":125},{"$f":"(E6/1000)*'Transport og energibehov'!D26*'Transport og energibehov'!D12*'Transport og energibehov'!N26","v":0.92999999999999994},{"$f":"(E6/1000)*'Transport og energibehov'!D26*'Transport og energibehov'!D12*'Transport og energibehov'!M26","v":7.0000000000000007E-2},{"$f":"(E6/1000)*'Transport og energibehov'!H26*'Transport og energibehov'!D12*'Transport og energibehov'!L26","v":0}]
[null,null,"Stålkonstruksjon",null,{"$f":"Beregningsfaktorer!D31","v":219},{"$f":"(E7/1000)*'Transport og energibehov'!D25*'Transport og energibehov'!D11*'Transport og energibehov'!N25","v":1.6293599999999999},{"$f":"(E7/1000)*'Transport og energibehov'!D25*'Transport og energibehov'!D11*'Transport og energibehov'!M25","v":0.12264000000000001},{"$f":"(E7/1000)*'Transport og energibehov'!H25*'Transport og energibehov'!D11*'Transport og energibehov'!L25","v":0}]
[null,"Veioverbygning","Slitelag (Ska)",{"$f":"Beregningsfaktorer!D19","v":4.4999999999999998E-2},{"$f":"D8*Beregningsfaktorer!D7","v":112.5},{"$f":"(E8/1000)*'Transport og energibehov'!D20*'Transport og energibehov'!D7*'Transport og energibehov'!N20","v":6.2774999999999997E-2},{"$f":"(E8/1000)*'Transport og energibehov'!D20*'Transport og energibehov'!D7*'Transport og energibehov'!M20","v":4.7250000000000009E-3},{"$f":"(E8/1000)*'Transport og energibehov'!H20*'Transport og energibehov'!D7*'Transport og energibehov'!L20","v":0}]
[null,null,"Bindlag (Ska)",{"$f":"Beregningsfaktorer!D20","v":3.5000000000000003E-2},{"$f":"D9*Beregningsfaktorer!D7","v":87.500000000000014},{"$f":"(E9/1000)*'Transport og energibehov'!D20*'Transport og energibehov'!D7*'Transport og energibehov'!N20","v":4.8825E-2},{"$f":"(E9/1000)*'Transport og energibehov'!D20*'Transport og energibehov'!D7*'Transport og energibehov'!M20","v":3.6750000000000007E-3},{"$f":"(E9/1000)*'Transport og energibehov'!H20*'Transport og energibehov'!D7*'Transport og energibehov'!L20","v":0}]
[null,null,"Fuktisolasjon (Topeka)",{"$f":"Beregningsfaktorer!D24","v":1.2E-2},{"$f":"D10*Beregningsfaktorer!D13","v":30},{"$f":"(E10/1000)*'Transport og energibehov'!D27*'Transport og energibehov'!D13*'Transport og energibehov'!N27","v":3.9059999999999991E-2},{"$f":"(E10/1000)*'Transport og energibehov'!D27*'Transport og energibehov'!D13*'Transport og energibehov'!M27","v":2.9399999999999999E-3},{"$f":"(E10/1000)*'Transport og energibehov'!H27*'Transport og energibehov'!D13*'Transport og energibehov'!L27","v":0}]
[]
[]
[null,"Anleggsareid"]
[null,"Kategori","Maskintype","Anleggsarbeid",null,null,null,"Kommentar"]
[null,null,null,"Arbeidshastighet\n[m2/time]","Mengde diesel\n[liter/m2]","Mengde bio\n[liter/m2]","Mengde el\n[kWh/m2]"]
[null,"Konstruksjon","Kran første 400 m2",{"$f":"'Transport og energibehov'!D52","v":1.6666666666666667},null,null,{"$f":"('Transport og energibehov'!H37/D16)*'Transport og energibehov'!L37","v":29.16},"Antatt 100 % el"]
[null,null,"Kran resten av bru",{"$f":"'Transport og energibehov'!D53","v":3.3333333333333335},null,null,{"$f":"('Transport og energibehov'!H37/D17)*'Transport og energibehov'!L37","v":14.58},"Antatt 100 % el"]
[null,null,"Gravemaskin",{"$f":"('Transport og energibehov'!D49*1000)/(E5+E6+E7)","v":70.515231289958635},{"$f":"('Transport og energibehov'!D34/D18)*'Transport og energibehov'!N34","v":0.26377279999999997},{"$f":"('Transport og energibehov'!D34/D18)*'Transport og energibehov'!M34","v":1.9853866666666668E-2},{"$f":"('Transport og energibehov'!H34/D18)*'Transport og energibehov'!L34","v":0}]
[null,"Slitelag","Veivals",{"$f":"('Transport og energibehov'!D46*1000)/E8","v":666.66666666666663},{"$f":"('Transport og energibehov'!D31/D19)*'Transport og energibehov'!N31","v":4.1850000000000004E-3},{"$f":"('Transport og energibehov'!D31/D19)*'Transport og energibehov'!M31","v":3.1500000000000007E-4},{"$f":"('Transport og energibehov'!H31/D19)*'Transport og energibehov'!L31","v":0}]
[null,null,"Traktor",{"$f":"('Transport og energibehov'!D47*1000)/E8","v":2666.6666666666665},{"$f":"('Transport og energibehov'!D32/D20)*'Transport og energibehov'!N32","v":1.7437500000000001E-3},{"$f":"('Transport og energibehov'!D32/D20)*'Transport og energibehov'!M32","v":1.3125000000000002E-4},{"$f":"('Transport og energibehov'!H32/D20)*'Transport og energibehov'!L32","v":0}]
[null,null,"Asfaltutlegger",{"$f":"('Transport og energibehov'!D48*1000)/E8","v":33.333333333333336},{"$f":"('Transport og energibehov'!D33/D21)*'Transport og energibehov'!N33","v":8.3699999999999997E-2},{"$f":"('Transport og energibehov'!D33/D21)*'Transport og energibehov'!M33","v":6.3E-3},{"$f":"('Transport og energibehov'!H33/D21)*'Transport og energibehov'!L33","v":0}]
[null,"Bindlag","Veivals",{"$f":"('Transport og energibehov'!D46*1000)/E9","v":857.142857142857},{"$f":"('Transport og energibehov'!D31/D22)*'Transport og energibehov'!N31","v":3.2550000000000001E-3},{"$f":"('Transport og energibehov'!D31/D22)*'Transport og energibehov'!M31","v":2.4500000000000005E-4},{"$f":"('Transport og energibehov'!H31/D22)*'Transport og energibehov'!L31","v":0}]
[null,null,"Traktor",{"$f":"('Transport og energibehov'!D47*1000)/E9","v":3428.571428571428},{"$f":"('Transport og energibehov'!D32/D23)*'Transport og energibehov'!N32","v":1.3562500000000003E-3},{"$f":"('Transport og energibehov'!D32/D23)*'Transport og energibehov'!M32","v":1.0208333333333337E-4},{"$f":"('Transport og energibehov'!H32/D23)*'Transport og energibehov'!L32","v":0}]
[null,null,"Asfaltutlegger",{"$f":"('Transport og energibehov'!D48*1000)/E9","v":42.857142857142847},{"$f":"('Transport og energibehov'!D33/D24)*'Transport og energibehov'!N33","v":6.5100000000000019E-2},{"$f":"('Transport og energibehov'!D33/D24)*'Transport og energibehov'!M33","v":4.9000000000000016E-3},{"$f":"('Transport og energibehov'!H33/D24)*'Transport og energibehov'!L33","v":0}]
[null,"Fuktsikring","Veivals",{"$f":"('Transport og energibehov'!D46*1000)/E10","v":2500},{"$f":"('Transport og energibehov'!D31/D25)*'Transport og energibehov'!N31","v":1.1159999999999998E-3},{"$f":"('Transport og energibehov'!D31/D25)*'Transport og energibehov'!M31","v":8.3999999999999995E-5},{"$f":"('Transport og energibehov'!H31/D25)*'Transport og energibehov'!L31","v":0}]
[null,null,"Traktor",{"$f":"('Transport og energibehov'!D47*1000)/E10","v":10000},{"$f":"('Transport og energibehov'!D32/D26)*'Transport og energibehov'!N32","v":4.6499999999999997E-4},{"$f":"('Transport og energibehov'!D32/D26)*'Transport og energibehov'!M32","v":3.5000000000000004E-5},{"$f":"('Transport og energibehov'!H32/D26)*'Transport og energibehov'!L32","v":0}]
[null,null,"Asfaltutlegger",{"$f":"('Transport og energibehov'!D48*1000)/E10","v":125},{"$f":"('Transport og energibehov'!D33/D27)*'Transport og energibehov'!N33","v":2.232E-2},{"$f":"('Transport og energibehov'!D33/D27)*'Transport og energibehov'!M33","v":1.6800000000000003E-3},{"$f":"('Transport og energibehov'!H33/D27)*'Transport og energibehov'!L33","v":0}]

{"sheet":"Kulvert","index":17,"n_rows":11,"n_cols":9,"rows_kept":11,"cut":false,"hidden":false,"merged":[[1,1,1,8],[2,3,2,4],[7,1,7,7],[2,5,2,7]]}
[]
[null,"Materialer og transport"]
[null,"Kategori","Materialtype","Materialmengder",null,"Transport",null,null,"Kommentar"]
[null,null,null,"Volum\n[m3/m2]","Masse per areal\n[kg/m2]","Mengde diesel\n[liter/m2]","Mengde bio \n[liter/m2]","Mengde el\n[kWh/m2]"]
[null,"Konstruksjon","Betong",{"$f":"(Beregningsfaktorer!D36*2)+(Beregningsfaktorer!D36*Beregningsfaktorer!D37)","v":1.248},{"$f":"(D5*Beregningsfaktorer!D4)","v":2995.2},{"$f":"(E5/1000)*'Transport og energibehov'!D24*'Transport og energibehov'!D10*'Transport og energibehov'!N24","v":2.2284287999999997},{"$f":"(E5/1000)*'Transport og energibehov'!D24*'Transport og energibehov'!D10*'Transport og energibehov'!M24","v":0.1677312},{"$f":"(E5/1000)*'Transport og energibehov'!H24*'Transport og energibehov'!D10*'Transport og energibehov'!L24","v":0}]
[null,null,"Armeringsstål",null,{"$f":"E5/Beregningsfaktorer!D38","v":230.39999999999998},{"$f":"(E6/1000)*'Transport og energibehov'!D26*'Transport og energibehov'!D12*'Transport og energibehov'!N26","v":1.7141759999999997},{"$f":"(E6/1000)*'Transport og energibehov'!D26*'Transport og energibehov'!D12*'Transport og energibehov'!M26","v":0.129024},{"$f":"(E6/1000)*'Transport og energibehov'!H26*'Transport og energibehov'!D12*'Transport og energibehov'!L26","v":0}]
[]
[null,"Anleggsarbeid"]
[null,"Kategori","Maskintype","Energiforbruk",null,null,null,"Kommentar"]
[null,null,null,"Arbeidshastighet\n[timer/stk]","Mengde diesel\n[liter/stk]","Mengde bio\n[liter/stk]","Mengde el\n[kWh/stk]"]
[null,"Konstruksjon","Tårnkran",{"$f":"Beregningsfaktorer!D39","v":18},"-","-",{"$f":"D11*'Transport og energibehov'!H37*'Transport og energibehov'!L37","v":874.80000000000007}]

{"sheet":"Vegetasjon og arealbeslag","index":18,"n_rows":21,"n_cols":9,"rows_kept":21,"cut":false,"hidden":false,"merged":[[2,3,2,7],[1,1,1,8],[7,1,7,8]]}
[]
[null,"Transport"]
[null,"Kategori",null,"Transport",null,null,null,null,"Kommentar"]
[null,null,null,"Vekt\n[kg/m2]","Vekt\n[kg/m3]","Mengde diesel\n[liter/m2]","Mengde bio\n[liter/m2]","Mengde el\n[kWh/m2]"]
[null,"Jord","Jordmasser til linja",{"$f":"Beregningsfaktorer!D14*Beregningsfaktorer!D89","v":390},null,{"$f":"(D5/1000)*'Transport og energibehov'!D17*'Transport og energibehov'!D4*'Transport og energibehov'!N17","v":3.627E-3},{"$f":"(D5/1000)*'Transport og energibehov'!D17*'Transport og energibehov'!D4*'Transport og energibehov'!M17","v":2.7300000000000002E-4},{"$f":"(D5/1000)*'Transport og energibehov'!H17*'Transport og energibehov'!D4*'Transport og energibehov'!L17","v":0}]
[null,null,"Jordmasser til deponi",{"$f":"Beregningsfaktorer!D14*Beregningsfaktorer!D89","v":390},null,{"$f":"(D6/1000)*'Transport og energibehov'!D18*'Transport og energibehov'!D5*'Transport og energibehov'!N18","v":3.6269999999999997E-2},{"$f":"(D5/1000)*'Transport og energibehov'!D18*'Transport og energibehov'!D5*'Transport og energibehov'!M18","v":2.7300000000000002E-3},{"$f":"(D5/1000)*'Transport og energibehov'!H18*'Transport og energibehov'!D5*'Transport og energibehov'!L18","v":0}]
[]
[null,"Anleggsarbeid"]
[null,"Kategori","Energiforbruk",null,null,null,null,null,"Kommentar"]
[null,null,"Volum per areal\n[m3/m2]","Vekt\n[kg/m2]","Anleggsarbeid\n[time/m2]","Mengde diesel\n[liter/m2]","Mengde bio\n[liter/m2]","Mengde el\n[kWh/m2]"]
[null,"Fjerning av vegetasjonsdekke",{"$f":"Beregningsfaktorer!D89","v":0.3},{"$f":"C11*Beregningsfaktorer!D14","v":390},{"$f":"((D11/1000)/'Transport og energibehov'!D49)*2","v":5.1999999999999998E-3},{"$f":"E11*'Transport og energibehov'!D34*'Transport og energibehov'!N34","v":9.6719999999999987E-2},{"$f":"E11*'Transport og energibehov'!D34*'Transport og energibehov'!M34","v":7.28E-3},{"$f":"E11*'Transport og energibehov'!H34*'Transport og energibehov'!L34","v":0},"For Anleggsarbeid [time/m2]: ganger med to fordi massene også skal losses et sted."]
[]
[null,"Arealbruksendringer"]
[null,"Vegetasjonstype"]
[null,null,"Mengde\n[m2]"]
[null,"Fjernet skog - lav bonitet",{"$f":"'Prosjektbeskrivelse og inndata'!C21*'Prosjektbeskrivelse og inndata'!C24","v":0}]
[null,"Fjernet skog - middels bonitet",{"$f":"'Prosjektbeskrivelse og inndata'!C21*'Prosjektbeskrivelse og inndata'!C25","v":93145.454545454544}]
[null,"Fjernet skog - høy bonitet",{"$f":"'Prosjektbeskrivelse og inndata'!C21*'Prosjektbeskrivelse og inndata'!C26","v":0}]
[null,"Myr",{"$f":"'Prosjektbeskrivelse og inndata'!C21*'Prosjektbeskrivelse og inndata'!C27","v":0}]
[null,"Jordbruksareal",{"$f":"'Prosjektbeskrivelse og inndata'!C21*'Prosjektbeskrivelse og inndata'!C28","v":18629.090909090908}]
[null,"Utbygd areal",{"$f":"'Prosjektbeskrivelse og inndata'!C21*'Prosjektbeskrivelse og inndata'!C29","v":74516.363636363632}]

{"sheet":"Sprengning","index":19,"n_rows":15,"n_cols":9,"rows_kept":15,"cut":false,"hidden":false,"merged":[[13,6,13,7],[14,6,14,7],[1,1,1,8],[2,4,2,7],[12,6,12,7],[12,2,12,5]]}
[]
[null,"Sprengning og transport"]
[null,"Kategori",null,"Materialer","Transport sprengstein",null,null,null,"Kommentar"]
[null,null,null,"Vekt tovex\n[kg/fm3]","Vekt sprengstein\n[kg/fm3]","Mengde diesel\n[liter/m3]","Mengde bio\n[liter/m3]","Mengde el\n[kWh/m3]"]
[null,"Sprengning i fjell","Sprengstoff",{"$f":"Beregningsfaktorer!D34","v":2.2000000000000002},{"$f":"Beregningsfaktorer!D16*D5","v":5830.0000000000009}]
[null,"Sprengning i dagen","Sprengstoff",{"$f":"Beregningsfaktorer!D33","v":1},{"$f":"Beregningsfaktorer!D16*D6","v":2650}]
[null,null,"Sprengstein til linja",null,{"$f":"Beregningsfaktorer!D16","v":2650},{"$f":"(E7/1000)*'Transport og energibehov'!D17*'Transport og energibehov'!D4*'Transport og energibehov'!N17","v":2.4644999999999997E-2},{"$f":"(E7/1000)*'Transport og energibehov'!D17*'Transport og energibehov'!D4*'Transport og energibehov'!M17","v":1.8550000000000001E-3},{"$f":"(E7/1000)*'Transport og energibehov'!H17*'Transport og energibehov'!D4*'Transport og energibehov'!L17","v":0}]
[null,null,"Sprengstein til deponi",null,{"$f":"Beregningsfaktorer!D16","v":2650},{"$f":"(E8/1000)*'Transport og energibehov'!D18*'Transport og energibehov'!D5*'Transport og energibehov'!N18","v":0.24645},{"$f":"(E8/1000)*'Transport og energibehov'!D18*'Transport og energibehov'!D5*'Transport og energibehov'!M18","v":1.8550000000000004E-2},{"$f":"(E8/1000)*'Transport og energibehov'!H18*'Transport og energibehov'!D5*'Transport og energibehov'!L18","v":0}]
[null,null,"Sprengstein til linja via pukkverk",null,{"$f":"Beregningsfaktorer!D16","v":2650},{"$f":"(E9/1000)*'Transport og energibehov'!D19*'Transport og energibehov'!D6*'Transport og energibehov'!N19","v":0.73934999999999984},{"$f":"(E9/1000)*'Transport og energibehov'!D19*'Transport og energibehov'!D6*'Transport og energibehov'!M19","v":5.5649999999999998E-2},{"$f":"(E9/1000)*'Transport og energibehov'!H19*'Transport og energibehov'!D6*'Transport og energibehov'!L19","v":0}]
[]
[]
[null,"Anleggsarbeid"]
[null,"Kategori","Anleggsarbeid",null,null,null,"Kommentar"]
[null,null,"Vekt\n[kg/fm3]","Mengde diesel\n[liter/fm3]","Mengde bio\n[liter/fm3]","Mengde el\n[kWh/fm3]"]
[null,"Lasting av sprengstein",{"$f":"Beregningsfaktorer!D16","v":2650},{"$f":"(C15/1000)/'Transport og energibehov'!D49*'Transport og energibehov'!D34*'Transport og energibehov'!N34","v":0.3286},{"$f":"(C15/1000)/'Transport og energibehov'!D49*'Transport og energibehov'!D34*'Transport og energibehov'!M34","v":2.4733333333333336E-2},{"$f":"(C15/1000)/'Transport og energibehov'!D49*'Transport og energibehov'!H34*'Transport og energibehov'!L34","v":0}]

{"sheet":"Reasfaltering","index":20,"n_rows":17,"n_cols":8,"rows_kept":17,"cut":false,"hidden":false,"merged":[[11,3,11,6],[5,4,5,6],[5,2,5,3],[10,1,10,7],[4,1,4,7]]}
[null,"Reasfaltering"]
[null,"Bakgrunnsdata"]
[null,"Andel som reasfalteres",{"$f":"Beregningsfaktorer!D59","v":0.6}]
[]
[null,"Materialer og transport"]
[null,"Kategori","Materialmengder",null,"Transport",null,null,"Kommentar"]
[null,null,"Volum/areal\n[m3/m2]","Masse per areal\n[kg/m2]","Mengde diesel\n[liter/m2]","Mengde bio\n[liter/m2]","Mengde el\n[kWh/m2]"]
[null,"Slitelag (Ska)",{"$f":"Beregningsfaktorer!D19","v":4.4999999999999998E-2},{"$f":"C8*Beregningsfaktorer!D6*Reasfaltering!C3","v":67.5},{"$f":"(D8/1000)*'Transport og energibehov'!D19*'Transport og energibehov'!D6*'Transport og energibehov'!N19","v":1.8832499999999999E-2},{"$f":"(D8/1000)*'Transport og energibehov'!D19*'Transport og energibehov'!D6*'Transport og energibehov'!M19","v":1.4175000000000001E-3},{"$f":"(D8/1000)*'Transport og energibehov'!H19*'Transport og energibehov'!D6*'Transport og energibehov'!L19","v":0}]
[null,"Slitelag (Agb)",{"$f":"Beregningsfaktorer!D19","v":4.4999999999999998E-2},{"$f":"C9*Beregningsfaktorer!D7*C3","v":67.5},{"$f":"(D9/1000)*'Transport og energibehov'!D20*'Transport og energibehov'!D7*'Transport og energibehov'!N20","v":3.7664999999999997E-2},{"$f":"(D9/1000)*'Transport og energibehov'!D20*'Transport og energibehov'!D7*'Transport og energibehov'!M20","v":2.8350000000000003E-3},{"$f":"(D9/1000)*'Transport og energibehov'!H20*'Transport og energibehov'!D7*'Transport og energibehov'!L20","v":0}]
[]
[null,"Anleggsarbeid"]
[null,"Kategori","Maskintype","Anleggsarbeid",null,null,null,"Kommentar"]
[null,null,null,"Arbeidshastighet\n[m2/time]","Mengde diesel\n[liter/m2]","Mengde bio\n[liter/m2]","Mengde el\n[kWh/m2]"]
[null,"Fjerning","Gravemaskin",{"$f":"('Transport og energibehov'!D49*1000)/D9","v":2222.2222222222222},{"$f":"('Transport og energibehov'!D34/D14)*'Transport og energibehov'!N34","v":8.3700000000000007E-3},{"$f":"('Transport og energibehov'!D34/D14)*'Transport og energibehov'!M34","v":6.3000000000000013E-4},{"$f":"('Transport og energibehov'!H34/D14)*'Transport og energibehov'!L34","v":0}]
[null,"Asfaltering","Veivals",{"$f":"('Transport og energibehov'!D46*1000)/D9","v":1111.1111111111111},{"$f":"('Transport og energibehov'!D31/D15)*'Transport og energibehov'!N31","v":2.5109999999999998E-3},{"$f":"('Transport og energibehov'!D31/D15)*'Transport og energibehov'!M31","v":1.8900000000000004E-4},{"$f":"('Transport og energibehov'!H31/D15)*'Transport og energibehov'!L31","v":0}]
[null,null,"Traktor",{"$f":"('Transport og energibehov'!D47*1000)/D9","v":4444.4444444444443},{"$f":"('Transport og energibehov'!D32/D16)*'Transport og energibehov'!N32","v":1.0462500000000001E-3},{"$f":"('Transport og energibehov'!D32/D16)*'Transport og energibehov'!M32","v":7.8750000000000017E-5},{"$f":"('Transport og energibehov'!H32/D16)*'Transport og energibehov'!L32","v":0}]
[null,null,"Asfaltutlegger",{"$f":"('Transport og energibehov'!D48*1000)/D9","v":55.555555555555557},{"$f":"('Transport og energibehov'!D33/D17)*'Transport og energibehov'!N33","v":5.0219999999999994E-2},{"$f":"('Transport og energibehov'!D33/D17)*'Transport og energibehov'!M33","v":3.7800000000000004E-3},{"$f":"('Transport og energibehov'!H33/D17)*'Transport og energibehov'!L33","v":0}]

{"sheet":"Beregningsfaktorer arbeidsfane","index":21,"n_rows":389,"n_cols":18,"rows_kept":389,"cut":false,"hidden":true,"merged":[[12,7,13,7]]}
["OK?","Faktor","Gammel verdi","Enhet","Fane","Bruksområde","Kategori","Dokumentasjon gammel verdi","VegLCA","Dokumentasjon VegLCA","Kommentar","Vurdering","Foreslått ny verdi","Enhet","Dokumentasjon verdi i oppdatert verktøy","Evt. kommentar ny verdi i verktøy","Evt. lenker kilder"]
[null,"Massetettheter"]
["OK","Betong massetetthet",2400,"kg/m3","Tunnel (begge) ","Beregning av dieselforbruk transport m.m.","Massetetthet","Ingen",2400,"Norsk betongforening Publikasjon 37: Lavkarbonbetong (2015)","Samme i VegLCA, god dokumentasjon","Beholde",{"$f":"IF(L3=\"Beholde\",C3,IF(L3=\"Fjerne\",\"-\",\"\"))","v":2400},{"$f":"IF(L3=\"Beholde\",D3,IF(L3=\"Fjerne\",\"-\",IF(OR(L3=\"Oppdatere\",L3=\"Legge til\",L3=\"Bake inn i annen faktor\"),D3,\"\")))","v":"kg/m3"},"Norsk betongforening Publikasjon 37: Lavkarbonbetong (2015)"]
["OK","Armeringsstål massetetthet",7800,"kg/m3","Tunnel (begge) ","Brukes ikke","Massetetthet","Ingen",7400,"Densities of solids, The engineering toolbox (men denne oppgir 7850?)","7850 i metoderapport og på engineering toolbox, foreslår å bruke det. VegLCA bør vurdere oppdatering. ","Oppdatere",7850,{"$f":"IF(L4=\"Beholde\",D4,IF(L4=\"Fjerne\",\"-\",IF(OR(L4=\"Oppdatere\",L4=\"Legge til\",L4=\"Bake inn i annen faktor\"),D4,\"\")))","v":"kg/m3"},"Metoderapport s. 8, Engineering Toolbox, https://www.engineeringtoolbox.com/metal-alloys-densities-d_50.html "]
["OK","Sikringsbolter massetetthet",7800,"kg/m3","Tunnel (begge) ","Brukes ikke","Massetetthet","Ingen",7400,"Densities of solids, The engineering toolbox (men denne oppgir 7850?)","Samme som armeringsstål - bare ha én for stål. 7850 i metoderapport og på engineering toolbox, foreslår å bruke det. VegLCA bør vurdere oppdatering. ","Fjerne",{"$f":"IF(L5=\"Beholde\",C5,IF(L5=\"Fjerne\",\"-\",\"\"))","v":"-"},"-",{"$f":"IF(OR(L5=\"Fjerne\",L5=\"Bake inn i annen faktor\"),\"-\",\"\")","v":"-"}]
["OK","Asfaltbetong massetetthet",2500,"kg/m3","Tunnel (begge) ","Beregning av dieselforbruk transport m.m.","Massetetthet","Ingen",2500,"Klimamodul EFFEKT 6.74","Til slitelag, bindlag og skulder. Anbefalt verdi etter samkjøring. Står i metoderapport s. 34. ","Beholde",2500,"kg/m3","Metoderapport s. 34"]
["OK","Asfaltgrus massetetthet",2400,"kg/m3","Tunnel (begge) ","Beregning av dieselforbruk transport m.m. for bærelag","Massetetthet","Metoderapport s. 32",2400,"Klimamodul EFFEKT 6.74","Til bærelag. Verdi i metoderapport er for AP, mens Ag har 2,65. Beholder 2400 for å sørge for høyest mulig grad av samsvar","Beholde",2400,"kg/m3","Klimamodul EFFEKT 6.74"]
["OK","Pukk/grus frostsikring massetetthet",1800,"kg/m3",null,"Beregning av dieselforbruk transport m.m.","Massetetthet","Ingen",1500,"Forsterkningslag i kult fra metoderapport s. 32","VegLCA er ikke oppdatert etter anbefalt verdi i samkjøringsprosjekt","Oppdatere",1550,"kg/m3","Anbefalt verdi i samkjøringsprosjekt, snitt av minimums- og maksimumsverdi (1,4-1,7) i EPDer"]
["OK","Pukk/grus forsterkningslag massetetthet",1500,"kg/m3","Tunnel (begge) ","Beregning av dieselforbruk transport m.m.","Massetetthet","Forsterkningslag i kult fra metoderapport s. 32",1500,"Forsterkningslag i kult fra metoderapport s. 32","VegLCA er ikke oppdatert etter anbefalt verdi i samkjøringsprosjekt","Oppdatere",1550,"kg/m3","Anbefalt verdi i samkjøringsprosjekt, snitt av minimums- og maksimumsverdi (1,4-1,7) i EPDer",null,"https://www.epd-norge.no/getfile.php/139362-1537176670/EPDer/Byggevarer/Asfalt/NEPD-1257-403_Crushed-Stone-Bergkrossprodukter_1_1.pdf","https://www.epd-norge.no/getfile.php/138731-1520978061/EPDer/Byggevarer/Asfalt/527_Crushed-stone-construction-aggregate-products--Oslo-and-Baerum_no.pdf"]
["OK","XPS massetetthet",25,"kg/m3","Utslippsfaktorer","Beregning av massetetthet XPS-/betongelement brukt til frostsikring i tunnel","Massetetthet","Ingen",35,"Antakelser basert på produsentdata fra Foamular, PakBoard, Thermals)","Oppdatere til VegLCA sin faktor for å sørge for høyest mulig grad av samsvar, i tillegg til manglende dokumentasjon for vår faktor. 35 kg/m3 samsvarer godt med informasjon på nett.","Oppdatere",35,"kg/m3","VegLCA (kommunikasjon med leverandører)"]
["OK","XPS-/betongelement til frostsikring i tunnel massetetthet",1800,"kg/m3","Tunnel (begge) ","Beregning av dieselforbruk transport m.m.","Massetetthet","Ingen","IR",{"$f":"IF(I11=\"IR\",\"-\",\"\")","v":"-"},"Estimert som gjennomsnittet av massetetthetene til betong og XPS basert på EPD fra Ølen betong der elementene består av 50 mm  XPS og 150 mm betong (150 * 2400 + 50 * 25)/200 = 1800 kg/m3. Usikkert hvor massetetthet til XPS er hentet fra. I samkjøringsprosjekt står det at massetetthet til XPS ikke er relevant i NIRAS' verktøy. Foreslår å heller benytte 35 kg/m3 som i VegLCA","Oppdatere",{"$f":"(50*M10+150*M3)/(M24*1000)","v":1808.75},"kg/m3","EPD XPS-/betongelement Ølen betong"]
["OK","Topeka massetetthet","IR","kg/m3",null,"Beregning av dieselforbruk transport m.m.","Massetetthet","-",2500,"Samme som asfalt, dvs. Klimamodul EFFEKT",null,"Legge til",2500,"kg/m3","Metoderapport s. 34, bruker samme som asfaltbetong"]
["OK","Vegetasjonsdekke  massetetthet",2000,"kg/m3","Fjerning av vegetasjon",null,"Massetetthet",null,null,null,null,"Oppdatere",1300,"kg/m3","Metoderapport s. 32"]
["OK","Myr massetetthet",null,null,null,null,"Massetetthet",null,null,null,null,"Oppdatere",150,"kg/m3","\"Utredning myr\", Hadsel kommune (Asplan Viak, 2017)"]
["OK","Massetetthet sprengstein",2650,"kg/m3","Masser",null,"Massetetthet",null,null,null,null,"Beholde",2650,"kg/m3","Metoderapport s. 32"]
["OK","Masser fra grøfterensk massetetthet",1600,"kg/m3","Drift",null,"Massetetthet",null,null,null,null,"Oppdatere",1300,"kg/m3","Metoderapport s. 32"]
[null,"Materialtykkelser/-mengder",null,null,null,null,null,null,null,"",null,null,"",""]
["OK","Slitelag tykkelse",4.4999999999999998E-2,"m","Vei, tunnel (begge), bru (begge), asfalt annet","Beregning av materialforbruk og transport m.m.","Materialtykkelse","N200","IR","-",null,"Beholde",4.4999999999999998E-2,"m","N200"]
["OK","Bindlag tykkelse",3.5000000000000003E-2,"m","Vei, tunnel (begge), bru (begge), asfalt annet","Beregning av materialforbruk og transport m.m.","Materialtykkelse","N200","IR","-",null,"Beholde",3.5000000000000003E-2,"m","N200"]
["OK","Bærelag tykkelse",0.13,"m","Vei, tunnel (begge), bru (begge), asfalt annet","Beregning av materialforbruk og transport m.m.","Materialtykkelse","N200","IR","-",null,"Beholde",0.13,"m","N200"]
["OK","Forsterkningslag tykkelse",0.45,"m","Vei, tunnel (begge), bru (begge), asfalt annet","Beregning av materialforbruk og transport m.m.","Materialtykkelse","N200","IR","-",null,"Beholde",0.45,"m","N200"]
["OK","Frostsikringslag vei tykkelse","1,74 eller 1,09","m","Vei, asfalt annet","Beregning av materialforbruk og transport m.m.","Materialtykkelse","N200","IR","-","Avhenger av andel av veien plassert på fjell. Dersom fjell: 1,09. Foreslår å heller sette standard tykkelse 1,74 og evt. redusere i hht. N200 basert på klimasone og telefarlighetsklasse","Oppdatere",1.74,"m","N200"]
["OK","Topeka tykkelse","IR","m","Bru","Beregning av materialforbruk og transport m.m.","Materialtykkelse","-",1.2E-2,"Ikke kommentert","VegLCA bruker det samme i beregningene, men det er ikke eksplisitt","Legge til",1.2E-2,"m","SVV Håndbok R762","R: endret fra 0,12 til 0,012, antar at det var en skrivefeil? "]
["OK","Frostsikringselement tunnel tykkelse",0.2,"m","Tunnel (begge)","Beregning av materialforbruk og transport m.m.","Materialtykkelse","EPD for element fra Ølen Betong","IR","-","Standardelement til frostsikring av tunnel fra Ølen Betong, basert på EPD: Element for samferdselstunneler med 150 mm tykkelse i betong og 50 mm XPS 200 kpa\nisolasjon.","Beholde",0.2,"m","EPD for element fra Ølen Betong"]
["OK","Mengde sprengstoff sprengning i dagen",1,"kg/fm3","Bru (begge), masser ","Beregning av utslipp knyttet sprenging","Materialmengde","Metoderapport","IR",{"$f":"IF(I25=\"IR\",\"-\",\"\")","v":"-"},null,"Beholde",{"$f":"IF(L25=\"Beholde\",C25,IF(L25=\"Fjerne\",\"-\",\"\"))","v":1},"kg/fm3","Metoderapport og dokumentasjon EFFEKT 2015 (SVV Rapport 358)","EFFEKT og Metoderapport oppgir ikke kilden de har brukt, og verdien bør derfor sokumenteres bedre i samtlige verktøy"]
["OK","Mengde sprengstoff sprengning tunnel",2.2000000000000002,"kg/fm3","Masser ","Beregning av utslipp knyttet sprenging","Materialmengde","NIRAS erfaringstall og  rapport fra 2009 mener 2,2 kg sprengstoff","IR",{"$f":"IF(I26=\"IR\",\"-\",\"\")","v":"-"},"\"200% høyere sprengstofforbruk i tunnel. Antar dobbelt så mye arbeid som for vei i dagen\" - stemmer ikke helt?","Beholde",{"$f":"IF(L26=\"Beholde\",C26,IF(L26=\"Fjerne\",\"-\",\"\"))","v":2.2000000000000002},"kg/fm3","Metoderapport og dokumentasjon EFFEKT 2015 (SVV Rapport 358). ","Dette tallet ser ut til å være noe høyt sammenliknet med andre kilder på nett. EFFEKT og Metoderapport oppgir ikke kilden de har brukt, og verdien bør derfor sokumenteres bedre i samtlige verktøy"]
["OK","Asfaltbetong bru tykkelse",0.08,"m","Bru (begge)","Beregning av materialforbruk og transport m.m.","Materialtykkelse","Ingen","IR","-","Naturlig å anta samme tykkelse som slitelag + bindlag på vei --> 0,08 m. Legger ikke inn en egen faktor for dette. ","Fjerne",{"$f":"IF(L27=\"Beholde\",C27,IF(L27=\"Fjerne\",\"-\",\"\"))","v":"-"},"-","N200 (i N400 henvises det til N200 for bindlag og slitelag)"]
["OK","Fuktisolering bru mengde",1.9,"kg/m2","Bru (begge)","Beregning av materialforbruk og transport m.m.","Materialmengde","Samkjøringsprosjekt","IR","-","Samkjøringsprosjektet sier 0,94 m2 fuktisolering per m2 bru og at laget består av polymermodifisert bitumen og sand. Erstatter med Topeka","Fjerne","-","-",{"$f":"IF(OR(L28=\"Fjerne\",L28=\"Bake inn i annen faktor\"),\"-\",\"\")","v":"-"}]
["OK","Frostsikring bru tykkelse",3.5000000000000003E-2,"m","Bru (begge)","Beregning av materialforbruk og transport m.m.","Materialtykkelse","Ingen","IR","-","\"Frostsikringslag med plater av ekstrudert polystyren (XPS) Antatt tykkelse 100 mm. Tetthet: 25 kg/m3\". Erstatter med Topeka","Fjerne","-","-","-"]
["OK","Betongmengde til betongbru",1.1399999999999999,"m3/m2","Betongbru","Material- og transportutslipp forbundet med betong","Materialmengde","Fra samkjørings-prosjekt og Metoderapport","IR","-","Verdi ser ut til å være basert på gjennomsnitt for 10 betongbruer i fellesprosjektet E16. Finner ikke dokumentasjon på dette og velger derfor å benytte gjennomsnitt fra samtlige 12 betongbruer i Metoderapporten","Oppdatere",1.29,"m3/m2","Metoderapport s. 47, gjennomsnitt for samtlige betongbruer, ikke vektet etter areal av bru"]
["OK","Betongmengde til stålbru",9.3999999999999997E-4,"m3/m2","Stålbru","Material- og transportutslipp forbundet med betong","Materialmengde","Fra samkjørings-prosjekt og Metoderapport","IR","-","Verdi ser ut til å være basert på gjennomsnitt for 10 betongbruer i fellesprosjektet E16. Finner ikke dokumentasjon på dette og velger derfor å benytte gjennomsnitt fra samtlige 8 stålbruer i Metoderapporten","Oppdatere",0.74299999999999999,"m3/m2","Metoderapport s. 47, gjennomsnitt for samtlige stålbruer, ikke vektet etter areal av bru"]
["OK","Mengde armeringsstål til betongbru",180,"kg/m2","Betongbru","Material- og transportutslipp forbundet med stål","Materialmengde","Samkjøringsprosjekt","IR","-","Verdi ser ut til å være basert på gjennomsnitt for 10 betongbruer i fellesprosjektet E16. Finner ikke dokumentasjon på dette og velger derfor å benytte gjennomsnitt fra samtlige 12 betongbruer i Metoderapporten","Oppdatere",231,"kg/m2","Metoderapport s. 47, gjennomsnitt for samtlige betongbruer, ikke vektet etter areal av bru"]
["OK","Mengde armeringsstål til stålbru",90,"kg/m2","Stålbru","Material- og transportutslipp forbundet med stål","Materialmengde","Samkjøringsprosjekt","IR","-","Verdi ser ut til å være basert på gjennomsnitt for 10 betongbruer i fellesprosjektet E16. Finner ikke dokumentasjon på dette og velger derfor å benytte gjennomsnitt fra samtlige 8 stålbruer i Metoderapporten","Oppdatere",125,"kg/m2","Metoderapport s. 47, gjennomsnitt for samtlige stålbruer, ikke vektet etter areal av bru"]
["OK","Mengde konstruksjonsstål til betongbru",18,"kg/m2","Betongbru","Material- og transportutslipp forbundet med stål","Materialmengde","Samkjøringsprosjekt","IR","-","Verdi ser ut til å være basert på gjennomsnitt for 10 betongbruer i fellesprosjektet E16. Finner ikke dokumentasjon på dette og velger derfor å benytte gjennomsnitt fra samtlige 12 betongbruer i Metoderapporten","Oppdatere",0,"kg/m2","Metoderapport s. 47, gjennomsnitt for samtlige betongbruer, ikke vektet etter areal av bru"]
["OK","Mengde konstruksjonsstål til stålbru",300,"kg/m2","Stålbru","Material- og transportutslipp forbundet med stål","Materialmengde","Samkjøringsprosjekt","IR","-","Usikker på dokumentasjon på dette. Velger derfor å benytte gjennomsnitt fra samtlige 8 stålbruer i Metoderapporten","Oppdatere",219,"kg/m2","Metoderapport s. 47, gjennomsnitt for samtlige stålbruer, ikke vektet etter areal av bru"]
["OK","Masse som må sprenges for bygging av bru",0.02,"m3/m2","Bru (begge)","Beregning av utslipp knyttet sprenging","Materialmengde","Ingen","IR","-","Gitt i samkjøringsprosjekt, trolig basert på gjennomsnitt for 10 betongbruer i fellesprosjektet E16. Finner ikke dokumentasjon for å verifisere dette, men i mangel på andre tilgjengelige data, beholdes tallet. ","Fjerne",{"$f":"IF(L36=\"Beholde\",C36,IF(L36=\"Fjerne\",\"-\",\"\"))","v":"-"},"-","Samkjøring, bør verifiseres"]
["OK","Mengde stål støttevegger og forankringer bru",28.7,"kg/m2","Bru (begge)","Material- og transportutslipp forbundet med stål","Materialmengde","Samkjøringsprosjekt","IR","-","Gitt i samkjøringsprosjekt, trolig basert på gjennomsnitt for 10 betongbruer i fellesprosjektet E16. Finner ikke dokumentasjon for å verifisere dette, men i mangel på andre tilgjengelige data, beholdes tallet. Antas i samkjøringsprosjekt å være i resirkulert stål","Fjerne",{"$f":"IF(L37=\"Beholde\",C37,IF(L37=\"Fjerne\",\"-\",\"\"))","v":"-"},"-","Samkjøring, bør verifiseres"]
["OK","Mengde stål autovern",16.5,"kg/m","Vei, tunnel (begge)","Material- og transportutslipp forbundet med stål","Materialmengde","Autovern: Håndbok N101 kriterier for valg av rekkverk. Styrkeklasse: Tabell 3,1 s. 38. Rundskriv endring N101 fartsgrense 110 km/t. Vekt:\nØrsta Vik sine Vik W3-rekkverk",20,"Klimodul i EFFEKT","\"Forutsetter styrkeklasse H1 ihht tabell 3.1 i Håndbok N101 og rundskriv om rekkverk 110 km/t. Forenkler til å beregne med samme rekkverkstandard på bruer. Ørsta Vik sine Vik W3-rekkverk veier 12,5 kg/m + 16 kg per stolpe. jf telefonsamtale representant Ørsta Vik desember 2016. Vanligvis stolper per 2 meter, men framover skal det holde med stolper per 4 meter. Stålet har krav til fasthet, men gjenvinningsgrad og leverandør kan variere da de handler inn stål i bulk på et stort stålmarked. Ikke noe \"finere\" kvalitet på stålet til rekkverk enn stålet på autovern\nAltså 12,5+4= 16,5 kg/meter. Ganget med 4 for firefelts: 66 kg/m\".\n\nVegLCA er ikke oppdatert etter samkjøringsprosjekt. ","Beholde",{"$f":"IF(L38=\"Beholde\",C38,IF(L38=\"Fjerne\",\"-\",\"\"))","v":16.5},"kg/m","Forutsetter styrkeklasse H1 ihht. tabell 3.1 og rundskriv om rekkverk 110 km/t. Forenkler til å beregne med samme rekkverkstandard på bruer. \n\nTar utgangspunkt i Vik Ørsta W3 siderekkverk, med vekt 12,5 kg/m + 16 kg per stolpe. jf telefonsamtale representant Ørsta Vik desember 2016. Rekkverket Vik EP H1 CC4 har stolpeavstand på 4 m -> Samlet vekt blir 12,5 + 16/4 = 16,5 kg/m. ","Stålet har krav til fasthet, men gjenvinningsgrad og leverandør kan variere da de handler inn stål i bulk på et stort stålmarked. Ikke noe \"finere\" kvalitet på stålet til rekkverk enn stålet på autovern. For firefeltsvei må rekkverkmengden ganges med 4. ","https://www.vikorsta.no/vegrekkverk/vegrekkverk/vik-ep-h1-cc4/"]
["OK","Vekt lyktestolper",261,"kg ","Vei, tunnel (begge), bru (begge)","Material- og transportutslipp forbundet med stål","Materialmengde","Høyde- og vektinformasjon om mast fra Euromast, vektinformasjon om fundament fra Vik Ørsta ",90,"Leverandører","Verdi er summen av vekt til mast (210 kg) og fundament (51 kg). Mast er 12 m høy. Ifølge samkjøringsprosjekt skulle VegLCA oppdateres med NIRAS' verdi. Euromast finnes ikke lenger - bruker mast fra VikØrsta i tillegg til fundament. Denne veier 176 kg -> totalt 227 kg. Anbefaler at VegLCA øker sin verdi noe. ","Oppdatere",227,"kg ","Produsentinformasjon fra Vik Ørsta AS. Produktkatalog 2020 s. 17 og s. 44 ",null,"https://ipaper.ipapercms.dk/Saferoad/vik-oersta/produktkatalog-lysmast/?page=22#/"]
["OK","Sikringsbolter tunnel",44,"kg/m","Tunnel","Materialutslipp forbundet med stål","Materialmengde","Metoderapport s. 33",null,null,null,"Beholde",44,"kg/m","Metoderapport s. 8 i vedlegg 1"]
["OK","Kulvertelementer tykkelse",1.18,"m3/m2","Kulvert","Materialutslipp forbundet med betong og stål","Materialmengde","Ingen","IR","-","\"Tverrsnittvolum = 31,15 m2. ref. Tegning typisk kulvert. V/A = 1,18 m3/m2. Bruker tetthet bettong 2,3 tonn/m3\". Her er det mye rart. Oppdaterer verdien. Oppdaterer til å bruke tykkelse på elementer istedenfor totalt betongvolum per m2 (som inkluderer tak, gulv og vegger)","Oppdatere",0.24,"m3/m2","Prefabrikkerte kulvertelementer, Statens vegvesen",null,"https://www.vegvesen.no/fag/teknologi/bruer/bruprosjektering/prefabrikkerte-kulvertelementer/_attachment/1361322?_ts=15d081de438&fast_title=Grunnlag%2C+beregningsforutsetninger+og+eksempel.pdf"]
["OK","Høyde på kulvert","IR","m","Kulvert","Materialutslipp forbundet med betong og stål","Materialmengde","IR","IR","-",null,"Legge til",3.2,"m","Prefabrikkerte kulvertelementer, Statens vegvesen",null,"https://www.vegvesen.no/fag/teknologi/bruer/bruprosjektering/prefabrikkerte-kulvertelementer/_attachment/1361322?_ts=15d081de438&fast_title=Grunnlag%2C+beregningsforutsetninger+og+eksempel.pdf"]
["OK","Forholdstall mellom betong og armering i kulvertelementer",12.3,"kg/kg","Kulvert","Materialutslipp forbundet med stål","Materialmengde","IR","IR","-",null,"Oppdatere",13,"kg/kg","Tar utgangspunkt i Metoderapprt s. 8 i vedlegg 1, der andelen betong er 13 ganger høyere enn andelen armering for samme volum."]
[null,"Arbeidshastigheter",null,null,null,null,null,null,null,"",null,null,"",""]
[null,"Arbeidshastighet veivals ",300,"t/h","Vei, tunnel (begge), bru (begge), asfalt annet","Beregning av drivstofforbruk valsing av bærelag, bindlag og slitelag","Arbeidshastighet","Ingen",null,"","Brukes til bærelag, bindlag og slitelag -> 2,4*0,13+2,5*(0,035+0,045) = 0,512 tonn/m2",null,"","",{"$f":"IF(OR(L45=\"Fjerne\",L45=\"Bake inn i annen faktor\"),\"-\",\"\")","v":""}]
[null,"Arbeidshastighet traktor ",300,"t/h","Vei, tunnel (begge), bru (begge), asfalt annet","Beregning av drivstofforbruk traktor for bærelag, bindlag og slitelag","Arbeidshastighet","Ingen",null,"","Brukes til bærelag, bindlag og slitelag -> 2,4*0,13+2,5*(0,035+0,045) = 0,512 tonn/m2",null,"","",""]
[null,"Arbeidshastighet asfaltutlegger ",300,"t/h","Vei, tunnel (begge), bru (begge), asfalt annet","Beregning av drivstofforbruk utlegging av bærelag, bindlag og slitelag","Arbeidshastighet","Ingen",null,"","Brukes til bærelag, bindlag og slitelag -> 2,4*0,13+2,5*(0,035+0,045) = 0,512 tonn/m2",null,"","",""]
[null,"Arbeidshastighet gravemaskin ",150,"t/h","Vei, tunnel (begge), bru (begge), asfalt annet","Beregning av drivstofforbruk til anlegging av forsterkningslag","Arbeidshastighet","Ingen",null,"","Brukes til forsterkningslag -> 0,45*1,5 = 0,675 tonn/m2. Endres med endret massetetthet pukk: 0,45*1,55 =0,6975 tonn/m2",null,"","",""]
[null,"Arbeidshastighet grovknuser ",125,"t/h","Vei, tunnel (begge), bru (begge), asfalt annet","Beregning av drivstofforbruk til anlegging av forsterkningslag","Arbeidshastighet","Ingen",null,"","Brukes til forsterkningslag -> 0,45*1,5 = 0,675 tonn/m2. Endres med endret massetetthet pukk: 0,45*1,55 =0,6975 tonn/m2",null,"","",""]
[null,"Arbeidshastighet finknuser ",250,"t/h","Vei, asfalt annet","Beregning av drivstofforbruk frostsikringslag","Arbeidshastighet","Ingen",null,"","Burde denne brukes på forsterkningslag fremfor frostsikringslag? ",null,"","",""]
["OK","Arbeidshastighet tårnkran ved bygging av første 400 m2 av bru",{"$f":"400/240","v":1.6666666666666667},"m2/h","Bru (begge)","Beregning av strømforbruk anleggsarbeid","Arbeidshastighet","\"Niras erfaringstall\"","IR",null,null,"Beholde",1.6666666666666667,"m2/h","NIRAS' erfaringstall","Verdi burde verifiseres med flere kilder. Store variasjoner avhengig av brutype, fundamenteringsforhold (geologi) og bruens størrelse. Faktoren kan sannsynligvis variere med pluss/minus 60 % avhengig av forholdene "]
["OK","Arbeidshastighet tårnkran ved bygging av resterende lengde bru",{"$f":"400/120","v":3.3333333333333335},"m2/h","Bru (begge)","Beregning av strømforbruk anleggsarbeid","Arbeidshastighet","\"Niras erfaringstall\"","IR",null,null,"Beholde",3.3333333333333335,"m2/h","NIRAS' erfaringstall","Verdi burde verifiseres med flere kilder. Store variasjoner avhengig av brutype, fundamenteringsforhold (geologi) og bruens størrelse. Faktoren kan sannsynligvis variere med pluss/minus 60 % avhengig av forholdene "]
["OK","Arbeidshastighet tårnkran ved bygging av kulvert",18,"h/kulvert","Kulvert","Beregning av strømforbruk anleggsarbeid","Arbeidshastighet","\"Niras erfaringstall\"","IR",null,"\"For en prefabrikert elementkulvert ca. 10 timer.\nFor en plasstøpt ca 25 timer. Bruker 18 timer som et gjennomsnitt\"","Beholde",18,"h/kulvert","NIRAS' erfaringstall","For en prefabrikert elementkulvert ca. 10 timer. For en plasstøpt ca 25 timer. Bruker 18 timer som et gjennomsnitt. Verdi burde verifiseres med flere kilder."]
["OK","Arbeidshastighet kantklipper",0.15625,"km/h","Drift","Beregning av drivstofforbruk","Arbeidshastighet","\"Niras erfaringstall\"","IR",null,"Antok hjullaster i gammel utgave, med en arbeidshastighet på 1250 m/dag, én dag = 8 h --> 1250/8=156,25 m/h. Virker veldig lav og er ikke dokumentert. Brukes til å beregne drivstofforbruk, og med hjullasterforbruk på 7,5 L/h, blir det 48 L/km, noe samkjøringsprosjektet kommenterer at er veldig høyt","Oppdatere",7.5,"km/h","Gjennomsnitt av verdier oppgitt av Maskinimportøren den 15.04.20, som sier deres traktor til kantklipping bruker ca. 8 min på å klippe 1-1,25 m kant i 1 km"]
["OK","Arbeidshastighet anleggsarbeid autovern",10,"m/h","Vei, tunnel (begge), bru (begge), asfalt annet, drift","Beregning av drivstofforbruk","Arbeidshastighet","\"Niras erfaringstall\"","IR","-","\"Antar at aggregat bakpå en lastebil bruker 4 L/t på utsetting av autovern, og at det legges 80 m overn. per dag for fire-felts vei. Én dag defineres som 8 timer.\" Ser ut til at antakelsen om 80 m/dag gjelder for både enkeltløps- og dobbeltløpstunnel samt alle veityper. Fjerner denne mellomregningsfaktoren og baker det direkte inn i faktoren for dieselforbruk i l/m rekkverk/autovern.","Bake inn i annen faktor",10,"m/h",{"$f":"IF(OR(L55=\"Fjerne\",L55=\"Bake inn i annen faktor\"),\"-\",\"\")","v":"-"}]
["OK","Arbeidshastighet gravemaskin grøfterensk",300,"m/h","Drift","Beregning av drivstofforbruk","Arbeidshastighet","\"Niras erfaringstall\"","IR","-","\"Grøfterensk skjer også ca hvert 3. år, lastebil for bortkjøring og gravemaskin ca 300 m i timen i snitt. Gravemaskin 20 liter/time =>0,067 liter/meter eller 66,67 liter/km renska grøft\"","Beholde",300,"m/h","NIRAS' erfaringstall. Bør verifiseres."]
[null,"Arbeidshastighet hjullaster til feiing",2000,"m/h","Drift","Beregning av drivstofforbruk","Arbeidshastighet","\"Niras erfaringstall\"","IR","-",null,"Beholde",2000,"m/h","NIRAS' erfaringstall. Bør verifiseres."]
[null,"Energiforbruk",null,null,null,null,null,null,null,"",null,null,"",""]
[null,"Dieseforbruk lastebil",0.6,"l/km","Drift","Utslipp transport","Energiforbruk","\"Niras erfaringstall\"",null,null,"Saltbil bruker 0,45. Bøytebil ler oppgitt å bruke 20 % mer enn lastebil, så det tilsvarer også lastebil = 0,45. "]
[null,"Dieselforbruk veivals ",3,"l/h","Vei, tunnel (begge), bru (begge), asfalt annet","Utslipp anleggsarbeid","Energiforbruk",null,null,"",null,null,"","",{"$f":"IF(OR(L60=\"Fjerne\",L60=\"Bake inn i annen faktor\"),\"-\",\"\")","v":""}]
[null,"Dieselforbruk traktor ",5,"l/h","Vei, tunnel (begge), bru (begge), asfalt annet","Utslipp anleggsarbeid","Energiforbruk",null,null,"",null,"Beholde",5,"l/h",{"$f":"IF(OR(L61=\"Fjerne\",L61=\"Bake inn i annen faktor\"),\"-\",\"\")","v":""}]
[null,"Dieselforbruk asfaltutlegger ",3,"l/h","Vei, tunnel (begge), bru (begge), asfalt annet","Utslipp anleggsarbeid","Energiforbruk",null,null,"",null,null,"","",""]
[null,"Dieselforbruk veimerking",5.8999999999999999E-3,"l/m","Vei, tunnel (begge), bru (begge), asfalt annet","Utslipp anleggsarbeid","Energiforbruk",null,null,null,"Regneverktøyet antar enhets arbeidshastighet for veimerking, altså at det merkes i en hastighet på 1 m2/h. I nytt verktøy: ikke gjøre denne antakelsen, heller bare regne ut dieselforbruk basert på total strekningslengde",null,null,"",""]
[null,"Dieselforbruk gravemaskin ",20,"l/h","Vei, tunnel (begge), bru (begge), asfalt annet","Utslipp anleggsarbeid","Energiforbruk",null,null,"",null,null,"","",""]
[null,"Dieselforbruk grovknuser ",25,"l/h","Vei, tunnel (begge), bru (begge), asfalt annet","Utslipp anleggsarbeid","Energiforbruk",null,null,"",null,null,"","",""]
[null,"Dieselforbruk finknuser ",25,"l/h","Vei, asfalt annet","Utslipp anleggsarbeid","Energiforbruk",null,null,"",null,null,"","",""]
["OK","Dieselforbruk hjullaster til feiing",7.5,"l/h","Drift","Utslipp anleggsarbeid","Energiforbruk","Ingen","IR",null,"\"VÅRFEIING: alle flater feies til 17. mai. Benyttes hjullaster eller stor traktor ( som for kantslått) med «broadway» http://www.aebi-schmidt.no/no/home pluss lastebil for bortkjøring. Feier ca 2 km i timen, et felt.(3,5 -4 m). Alternativt på småveger henges Broadwayen på en lastebil.  7-8 liter diesel/time. 1 lastebillass per 2 km\n\nHjullaster: 7,5 liter/time*x felt=>3,75*x liter/km feiet\"","Beholde",7.5,"l/h",""]
["OK","Dieselforbruk brøytebil",{"$f":"0.45*1.2","v":0.54},"l/km","Drift","Utslipp anleggsarbeid","Energiforbruk","Ingen",0.54,"Ingen","Vi sier 20 % mer enn lastebil, VegLCA har glemt å legge inn dokumentasjon, men kan vel anta at de har brukt vårt tall. ","Oppdatere",0.64,{"$f":"IF(L68=\"Beholde\",D68,IF(L68=\"Fjerne\",\"-\",IF(OR(L68=\"Oppdatere\",L68=\"Legge til\",L68=\"Bake inn i annen faktor\"),D68,\"\")))","v":"l/km"},"Gjennomsnitt for vindervedlikeholdskjøretøy fra \"Life cycle assessment of winter road maintenance\", Vignisdottir et. Al, The International Journal of Life Cycle Assessment (2020) "]
["OK","Dieselforbruk lastebil til salting",0.45,"l/km","Drift","Utslipp anleggsarbeid","Energiforbruk","Ingen","IR","-","\"Salting: lastebil det saltes stort sett 2/3 av dagene fra 15 oktober til 15 mars (100 dager). Det saltes 2 felt for hver runde for veitype 1 og 2. Må altså kjøre to runder for firefelts. Lastebil diesleforbruk 4,5 liter/mil. En saltdunk varer 40 km, da må en inn å fylle på salt. Transport av salt fra saltlager. Antar avstand saltlager 1 mil. 5,3 liter per vognkm. 358 kg salt /km strødd\"","Oppdatere",0.64,"l/km","Gjennomsnitt for vindervedlikeholdskjøretøy fra \"Life cycle assessment of winter road maintenance\", Vignisdottir et. Al, The International Journal of Life Cycle Assessment (2020) "]
["OK","Dieselforbruk anleggsarbeid autovern",0.4,"l/m","Vei, tunnel (begge), bru (begge), asfalt annet","Utslipp anleggsarbeid","Energiforbruk","Ingen",null,null,"\"Antar at aggregat bakpå en lastebil bruker 4 L/t på utsetting av autovern, og at det legges 80 m autovern per dag for fire-felts vei. Én dag defineres som 8 timer. Da får man 32 liter diesel/dag. 32 liter diesel per dag / 80 m autovern per dag => 0,4 liter diesel/m\"","Beholde",{"$f":"IF(L70=\"Beholde\",C70,IF(L70=\"Fjerne\",\"-\",\"\"))","v":0.4},"l/m","Antar at aggregat bakpå en lastebil bruker 4 L/t på utsetting av autovern, og at det legges 80 m autovern per dag for fire-felts vei. Én dag defineres som 8 timer. Da får man 32 liter diesel/dag. 32 liter diesel per dag / 80 m autovern per dag => 0,4 liter diesel/m. Tallet er verifisert av Marianne Gjerde i Arvid Gjerde AS, som i mailkommunikasjon den 14.04.20 sier at deres pelerigg bruker 0,42 liter pr meter montert rekkverk i snitt på ett år."]
["OK","Dieselforbruk kantklipping",7.5,"l/h","Fjerning av vegetasjon","Utslipp anleggsarbeid","Energiforbruk","Normine","IR",{"$f":"IF(I71=\"IR\",\"-\",\"\")","v":"-"},"Normine som kilde gir ikke mening, de produserer knuseverk. Men forbruket er satt likt som hjullaster. ","Beholde",{"$f":"IF(L71=\"Beholde\",C71,IF(L71=\"Fjerne\",\"-\",\"\"))","v":7.5},"l/h","Antar samme som dieselforbruk som traktor, siden det benyttes traktor til kantklipping jf. mailutveksling med Maskinimportøren den 15.04.20"]
["OK","Dieselforbruk kantklipping",48,"l/km","Fjerning av vegetasjon","Utslipp anleggsarbeid","Energiforbruk","Normine","IR",{"$f":"IF(I72=\"IR\",\"-\",\"\")","v":"-"},"Gammel verdi er beregnet fra arbeidshastighet på 1250/8 m/h og 7,5 L diesel/h. VegLCA har ikke med verdien ennå.","Oppdatere",{"$f":"5/7.5","v":0.66666666666666663},"l/km","Antar samme som dieselforbruk som traktor, 5 L/h, siden det benyttes traktor til kantklipping jf. mailutveksling med Maskinimportøren den 15.04.20. Arbeidshastighet er gjennomsnitt av verdier oppgitt av Maskinimportøren den 15.04.20, som sier deres traktor til kantklipping bruker ca. 8 min på å klippe 1-1,25 m kant i 1 km","Tallet er beregnet som (5 L diesel/h)/(7,5 km/t)"]
["OK","Elforbruk tårnkran",{"$f":"54*0.9","v":48.6},"kW","Bru (beggge)","Utslipp anleggsarbeid","Energiforbruk","Kranor","IR",null,null,"Beholde",48.6,"kW","Datablad Potain MDT 178 - 54 kVA. Antar PF 0,9. ",null,"https://kranor.no/siteassets/tarnkraner/datablader/mdt178-ny.pdf"]
["OK","Elforbruk belysning i dagen",1600,"kWh/(stk*år)","Drift","Utslipp energiforbruk og beregning","Energiforbruk","Samkjøringsprosjekt",1600,"Basert på Håndbok V124 - teknisk planlegging av veg- og tunnelbelysning. Forbruk: 400 W, 4100 brenntimer/år. Konservativt, mest representativt for høy ÅDT. ","Beholder samkjøringsverdi for å sørge for høyest mulig grad av samsvar. ","Beholde",1600,"kWh/(stk*år)","Samkjøringsprosjekt. Basert på Håndbok V124 - teknisk planlegging av veg- og tunnelbelysning. Forbruk: 400 W, 4100 brenntimer/år. Konservativt, mest representativt for høy ÅDT. "]
["OK","Elforbruk belysning i tunnel",26.5,"kWh/m","Drift","Utslipp energiforbruk og beregning","Energiforbruk","Metoderapport",null,null,"Metoderapporten bruker dette basert på at tunnelbelysning per lm skal være lik som per m vei i dagen","Oppdatere",{"$f":"C74*M82/1000","v":34},{"$f":"IF(L75=\"Beholde\",D75,IF(L75=\"Fjerne\",\"-\",IF(OR(L75=\"Oppdatere\",L75=\"Legge til\",L75=\"Bake inn i annen faktor\"),D75,\"\")))","v":"kWh/m"},"Antar likt som for vei i dagen basert på at det er det som gjøres i Metoderapport og dokumentasjon for EFFEKT 6.6"]
["OK","Elforbruk boring og ventilasjon v/ bygging tunnel enkeltløp",225,"kWh/m","Tunnel enkeltløp","Utslipp strømforbruk","Energiforbruk","Igo50 - 19 kVA. Antar PF = 0,9 => 17 kW","IR","-","Forstår ikke kilden i vårt verktøy her, Igo50 er en kran. Og hvordan gir 17 kW 45 kWh/m?\n\nDisse utslippene blir små sammenliknet med andre utslipp og det er usikkert om driving av tunnel egentlig er så relevant i denne sammenheng. I dagens verktøy brukes ikke faktoren. Foreslår å fjerne.  ","Fjerne","-","-",{"$f":"IF(OR(L76=\"Fjerne\",L76=\"Bake inn i annen faktor\"),\"-\",\"\")","v":"-"}]
["OK","Elforbruk boring og ventilasjon v/ bygging tunnel dobbeltløp",450,"kWh/m","Tunnel dobbeltløp","Utslipp strømforbruk","Energiforbruk","Igo50 - 19 kVA. Antar PF = 0,9 => 17 kW",450,"Statens vegvesen rapport nr. 358, 2015: Dokumentasjon av beregningsmoduler i EFFEKT 6.6","Forstår ikke kilden i vårt verktøy her, Igo50 er en kran. Og hvordan gir 17 kW 45 kWh/m?\n\nVegLCA bruker 6,6 kWh/m3 basert på 450 kWh/m fra rapport 358 og antatt areal for teoretisk sprengningsprofil på 70 m2. Tallene er altså like selv om de stammer fra ulike kilder. \n\nDisse utslippene blir små sammenliknet med andre utslipp og det er usikkert om driving av tunnel egentlig er så relevant i denne sammenheng. I dagens verktøy brukes ikke faktoren. Foreslår å fjerne.  ","Fjerne","-","-","-"]
[null,"Annet",null,null,null,null,null,null,null,"",null,null,"","",""]
["OK","Tonn per lass transport av veioverbygningsmaterialer  ",30,"tonn/lass","Tunnel (begge) ",null,"Lastekapasitet","Ingen",null,{"$f":"IF(I79=\"IR\",\"-\",\"\")","v":""},"Foreslår å heller bruke utslipp per tkm og ikke bruke transportkapasiteter","Fjerne",{"$f":"IF(L79=\"Beholde\",C79,IF(L79=\"Fjerne\",\"-\",\"\"))","v":"-"},"-","-"]
["OK","Tonn per lass transport av stålkonstruksjoner (lyktestolper og autovern) til tunnel",30,"tonn/lass","Tunnel (begge) ",null,"Lastekapasitet","Ingen",null,"","Foreslår å heller bruke utslipp per tkm og ikke bruke transportkapasiteter","Fjerne","-","-","-"]
["OK","Tonn per lass transport av stålkonstruksjoner (lyktestolper og autovern) til vei",20,"tonn/lass","Tunnel (begge) ",null,"Lastekapasitet","Ingen",null,"","Foreslår å heller bruke utslipp per tkm og ikke bruke transportkapasiteter","Fjerne","-","-","-"]
["OK","Lyktestolper per km",22.22,"stk","Vei, tunnel (begge), bru (begge)","Material- og transportutslipp forbundet med stål","Annet","Ingen","IR","-","\"Avstand mlm lyktestolper ca 45m plassert i midtdeler => 0,022 master/meter firefelts vei.\"\n\nBeholder MEW3. Historisk effektforbruk fra håndbok 264 (2008): 8,5 kW per km vei. 400 W armaturer (ref. verdi brukt til beregning av elforbruk per lykt) gir 8500/400 = 21,25 master per km ca. 47 m mellom hver) ","Oppdatere",21.25,"stk","Kilde belysningsklasse: Håndbok V124 (2014) tabell 3.2, s. 25. Kilde historisk effektforbruk: Håndbok 264 (2008) tabell 7.1 s. 66",null,"https://vegvesen.brage.unit.no/vegvesen-xmlui/bitstream/handle/11250/189779/h%c3%a5ndbok%20264.pdf?sequence=1&isAllowed=y","https://www.vegvesen.no/_attachment/61499"]
["OK","Tykkelse vegetasjonslag",0.3,"m",null,null,null,null,null,null,null,"Beholde",0.3,"m","NIRAS' erfaringstall. Bør verifiseres."]
["OK","Renset volum ved grøfterensk",0.13300000000000001,"m3/m",null,null,null,"Ingen","IR",{"$f":"IF(I84=\"IR\",\"-\",\"\")","v":"-"},null,"Beholde",0.13300000000000001,"m3/m","NIRAS' erfaringstall. Bør verifiseres."]
[null,"Levetider",null,null,null,null,null,null,null,"",null,null,"","",{"$f":"IF(L85=\"Fjerne\",\"-\",\"\")","v":""}]
["OK","Mast lyktestolper",30,"år","Vei, tunnel (begge), bru (begge)","Material- og transportutslipp forbundet med stål, tillegg som følge av utskiftning","Levetider","Håndbok 264 (2013) tabell 4.5 s. 51",30,"Erfaringstall infrastruktur, NIRAS",null,"Beholde",{"$f":"IF(L86=\"Beholde\",C86,IF(L86=\"Fjerne\",\"-\",\"\"))","v":30},"år","Håndbok V124 (2014) tabell 4.5 s. 51",null,"https://www.vegvesen.no/_attachment/61499"]
["OK","Autovern/rekkverk",30,"år","Vei, tunnel (begge), bru (begge)","Material- og transportutslipp forbundet med stål, tillegg som følge av utskiftning","Levetider","Ingen",30,"Håndbok N101",null,"Beholde",30,"år","Håndbok N101 Rekkverk\nog vegens sideområder (2014) s. 63"]
[null,"Drift og vedlikehold",null,null,null,null,null,null,null,{"$f":"IF(I88=\"IR\",\"-\",\"\")","v":""},null,null,"","",{"$f":"IF(OR(L88=\"Fjerne\",L88=\"Bake inn i annen faktor\"),\"-\",\"\")","v":""}]
["OK","Intervall reasfaltering",7,"år",null,null,null,null,null,"",null,"Beholde",7,"år","NIRAS' erfaringstall. Bør verifiseres."]
["OK","Andel som reasfalteres ved reasfaltering",0.6,"-",null,null,null,null,null,"",null,"Beholde",0.6,"-","NIRAS' erfaringstall. Bør verifiseres."]
["OK","Km brøyting per felt per km vei per år",80,"km/(km*felt*år)",null,null,null,"\"Niras erfaringstall\"","IR",{"$f":"IF(I91=\"IR\",\"-\",\"\")","v":"-"},"Regner 20 utrykninger per år med 4 brøyterunder. Foreslår å ikke bruke denne faktoren, men faktor fra mengderapport som gjennomsnitt per km vei uavhengig av antall felt. ","Fjerne",{"$f":"IF(L91=\"Beholde\",C91,IF(L91=\"Fjerne\",\"-\",\"\"))","v":"-"},{"$f":"IF(L91=\"Beholde\",D91,IF(L91=\"Fjerne\",\"-\",IF(OR(L91=\"Oppdatere\",L91=\"Legge til\",L91=\"Bake inn i annen faktor\"),D91,\"\")))","v":"-"},{"$f":"IF(OR(L91=\"Fjerne\",L91=\"Bake inn i annen faktor\"),\"-\",\"\")","v":"-"}]
["OK","Km brøyting per km vei per år","IR","km/(km*år)",null,null,null,"-",546.79999999999995,"Mengderapportering vinteren 2018/2019, SVV rapport 362","VegLCA bruker faktor fra rapport avhegning av region.","Legge til",724.7,{"$f":"IF(L92=\"Beholde\",D92,IF(L92=\"Fjerne\",\"-\",IF(OR(L92=\"Oppdatere\",L92=\"Legge til\",L92=\"Bake inn i annen faktor\"),D92,\"\")))","v":"km/(km*år)"},"Mengderapportering vinteren 2018/2019, SVV rapport 362. Landsgjennomsnitt for riksvei",null,"https://vegvesen.brage.unit.no/vegvesen-xmlui/bitstream/handle/11250/2620178/Mengderapport%202018_19%20SVV%20rapport%20362%20%285MB%29.pdf?sequence=1&isAllowed=y"]
["OK","Km salting per km tofelt per år",100,"km/(km*år)",null,null,null,null,null,null,"\"Salting: lastebil det saltes stort sett 2/3 av dagene fra 15 oktober til 15 mars (100 dager). Det saltes 2 felt for hver runde for veitype 1 og 2. Må altså kjøre to runder for firefelts. Lastebil diesleforbruk 4,5 liter/mil. En saltdunk varer 40 km, da må en inn å fylle på salt. Transport av salt fra saltlager. Antar avstand saltlager 1 mil. 5,3 liter per vognkm. 358 kg salt /km strødd\"","Beholde",{"$f":"IF(L93=\"Beholde\",C93,IF(L93=\"Fjerne\",\"-\",\"\"))","v":100},{"$f":"IF(L93=\"Beholde\",D93,IF(L93=\"Fjerne\",\"-\",IF(OR(L93=\"Oppdatere\",L93=\"Legge til\",L93=\"Bake inn i annen faktor\"),D93,\"\")))","v":"km/(km*år)"},"NIRAS' erfaringstall. Bør verifiseres."]
["OK","Saltforbruk",0.36,"tonn/(km*år)",null,null,null,"\"Niras erfaringstall\"",15.3,"Mengderapportering vinteren 2018/2019, SVV rapport 362","Vi har beregnet: 4,33 tonn per 40 km inkl saltlake. => 358 kg salt /km for 2 felt. VegLCA bruker faktor fra rapport avhegning av region.","Oppdatere",10.5,{"$f":"IF(L94=\"Beholde\",D94,IF(L94=\"Fjerne\",\"-\",IF(OR(L94=\"Oppdatere\",L94=\"Legge til\",L94=\"Bake inn i annen faktor\"),D94,\"\")))","v":"tonn/(km*år)"},"Mengderapportering vinteren 2018/2019, SVV rapport 362. Landsgjennomsnitt for riksvei",null,"https://vegvesen.brage.unit.no/vegvesen-xmlui/bitstream/handle/11250/2620178/Mengderapport%202018_19%20SVV%20rapport%20362%20%285MB%29.pdf?sequence=1&isAllowed=y"]
["OK","Energiforbruk viftedrift tunnel",{"$f":"3.7/1000","v":3.7000000000000002E-3},"kWh/(ÅDT*m*år)",null,null,null,"Metoderapport s. 46","?","","\"Fra metoderapport s. 46: 3,7 * ÅDT * x for x km per år for dobbeltløp. Ganges med lengde i \"Beregning\". Multipliseres ikke lenger med to ettersom det nå er enkeltløpstunneler.\"","Oppdatere","","kWh/(ÅDT*m*år)",""]
["OK","Energiforbruk viftedrift tunnel undersjøisk",{"$f":"3.7/1000","v":3.7000000000000002E-3},"kWh/(ÅDT*m*år)",null,null,null,"Metoderapport s. 46","?","",null,"Legge til","","kWh/(ÅDT*m*år)",""]
["OK","Energiforbruk pumpedrift (undersjøisk) tunnel",18,"kWh/(m*år)",null,null,null,"Metoderapport s. 45","?","","Regnet ut som 0,0021 kW/m*(8760 h/år) = 18,4 kWh/(m*år)","Beholde",18,"kWh/(m*år)","Metoderapport s. 45","Antar kun for undersjøiske tunneler"]
[null,null,null,null,null,null,null,null,null,"",null,null,"","",""]
[null,null,null,null,null,null,null,null,null,"",null,null,"","",""]
[null,null,null,null,null,null,null,null,null,"",null,null,"","",""]
[null,null,null,null,null,null,null,null,null,"",null,null,"","",""]
[null,null,null,null,null,null,null,null,null,"",null,null,"","",""]
[null,null,null,null,null,null,null,null,null,"",null,null,"","",""]
[null,null,null,null,null,null,null,null,null,"",null,null,"","",""]
[null,null,null,null,null,null,null,null,null,"",null,null,"","",""]
[null,null,null,null,null,null,null,null,null,"",null,null,"","",""]
[null,null,null,null,null,null,null,null,null,"",null,null,"","",""]
[null,null,null,null,null,null,null,null,null,"",null,null,"","",""]
[null,null,null,null,null,null,null,null,null,"",null,null,"","",""]
[null,null,null,null,null,null,null,null,null,"",null,null,"","",""]
[null,null,null,null,null,null,null,null,null,"",null,null,"","",""]
[null,null,null,null,null,null,null,null,null,"",null,null,"","",""]
[null,null,null,null,null,null,null,null,null,"",null,null,"","",""]
[null,null,null,null,null,null,null,null,null,"",null,null,"","",""]
[null,null,null,null,null,null,null,null,null,"",null,null,"","",""]
[null,null,null,null,null,null,null,null,null,"",null,null,"","",""]
[null,null,null,null,null,null,null,null,null,"",null,null,"","",""]
[null,null,null,null,null,null,null,null,null,"",null,null,"","",""]
[null,null,null,null,null,null,null,null,null,"",null,null,"","",""]
[null,null,null,null,null,null,null,null,null,"",null,null,"","",""]
[null,null,null,null,null,null,null,null,null,"",null,null,"","",""]
[null,null,null,null,null,null,null,null,null,"",null,null,"","",""]
[null,null,null,null,null,null,null,null,null,"",null,null,"","",""]
[null,null,null,null,null,null,null,null,null,"",null,null,"","",""]
[null,null,null,null,null,null,null,null,null,"",null,null,"","",""]
[null,null,null,null,null,null,null,null,null,"",null,null,"","",""]
[null,null,null,null,null,null,null,null,null,"",null,null,"","",""]
[null,null,null,null,null,null,null,null,null,"",null,null,"","",""]
[null,null,null,null,null,null,null,null,null,"",null,null,"","",""]
[null,null,null,null,null,null,null,null,null,"",null,null,"","",""]
[null,null,null,null,null,null,null,null,null,"",null,null,"","",""]
[null,null,null,null,null,null,null,null,null,"",null,null,"",{"$f":"IF(L132=\"Beholde\",D132,IF(L132=\"Fjerne\",\"-\",IF(OR(L132=\"Oppdatere\",L132=\"Legge til\",L132=\"Bake inn i annen faktor\"),D132,\"\")))","v":""},""]
[null,null,null,null,null,null,null,null,null,"",null,null,"","",""]
[null,null,null,null,null,null,null,null,null,"",null,null,"","",""]
[null,null,null,null,null,null,null,null,null,"",null,null,"","",""]
[null,null,null,null,null,null,null,null,null,"",null,null,"","",""]
[null,null,null,null,null,null,null,null,null,"",null,null,"","",""]
[null,null,null,null,null,null,null,null,null,"",null,null,"","",""]
[null,null,null,null,null,null,null,null,null,"",null,null,"","",""]
[null,null,null,null,null,null,null,null,null,"",null,null,"","",""]
[null,null,null,null,null,null,null,null,null,"",null,null,"","",""]
[null,null,null,null,null,null,null,null,null,"",null,null,"","",""]
[null,null,null,null,null,null,null,null,null,"",null,null,"","",""]
[null,null,null,null,null,null,null,null,null,"",null,null,"","",""]
[null,null,null,null,null,null,null,null,null,"",null,null,"","",""]
[null,null,null,null,null,null,null,null,null,"",null,null,"","",""]
[null,null,null,null,null,null,null,null,null,"",null,null,"","",""]
[null,null,null,null,null,null,null,null,null,"",null,null,"","",""]
[null,null,null,null,null,null,null,null,null,"",null,null,"","",""]
[null,null,null,null,null,null,null,null,null,"",null,null,"","",""]
[null,null,null,null,null,null,null,null,null,"",null,null,"","",""]
[null,null,null,null,null,null,null,null,null,{"$f":"IF(I152=\"IR\",\"-\",\"\")","v":""},null,null,{"$f":"IF(L152=\"Beholde\",C152,IF(L152=\"Fjerne\",\"-\",\"\"))","v":""},"",""]
[null,null,null,null,null,null,null,null,null,"",null,null,"","",{"$f":"IF(OR(L153=\"Fjerne\",L153=\"Bake inn i annen faktor\"),\"-\",\"\")","v":""}]
[null,null,null,null,null,null,null,null,null,"",null,null,"","",""]
[null,null,null,null,null,null,null,null,null,"",null,null,"","",""]
[null,null,null,null,null,null,null,null,null,"",null,null,"","",""]
[null,null,null,null,null,null,null,null,null,"",null,null,"","",""]
[null,null,null,null,null,null,null,null,null,"",null,null,"","",""]
[null,null,null,null,null,null,null,null,null,"",null,null,"","",""]
[null,null,null,null,null,null,null,null,null,"",null,null,"","",""]
[null,null,null,null,null,null,null,null,null,"",null,null,"","",""]
[null,null,null,null,null,null,null,null,null,"",null,null,"","",""]
[null,null,null,null,null,null,null,null,null,"",null,null,"","",""]
[null,null,null,null,null,null,null,null,null,"",null,null,"","",""]
[null,null,null,null,null,null,null,null,null,"",null,null,"","",""]
[null,null,null,null,null,null,null,null,null,"",null,null,"","",""]
[null,null,null,null,null,null,null,null,null,"",null,null,"","",""]
[null,null,null,null,null,null,null,null,null,"",null,null,"","",""]
[null,null,null,null,null,null,null,null,null,"",null,null,"","",""]
[null,null,null,null,null,null,null,null,null,"",null,null,"","",""]
[null,null,null,null,null,null,null,null,null,"",null,null,"","",""]
[null,null,null,null,null,null,null,null,null,"",null,null,"","",""]
[null,null,null,null,null,null,null,null,null,"",null,null,"","",""]
[null,null,null,null,null,null,null,null,null,"",null,null,"","",""]
[null,null,null,null,null,null,null,null,null,"",null,null,"","",""]
[null,null,null,null,null,null,null,null,null,"",null,null,"","",""]
[null,null,null,null,null,null,null,null,null,"",null,null,"","",""]
[null,null,null,null,null,null,null,null,null,"",null,null,"","",""]
[null,null,null,null,null,null,null,null,null,"",null,null,"","",""]
[null,null,null,null,null,null,null,null,null,"",null,null,"","",""]
[null,null,null,null,null,null,null,null,null,"",null,null,"","",""]
[null,null,null,null,null,null,null,null,null,"",null,null,"","",""]
[null,null,null,null,null,null,null,null,null,"",null,null,"","",""]
[null,null,null,null,null,null,null,null,null,"",null,null,"","",""]
[null,null,null,null,null,null,null,null,null,"",null,null,"","",""]
[null,null,null,null,null,null,null,null,null,"",null,null,"","",""]
[null,null,null,null,null,null,null,null,null,"",null,null,"","",""]
[null,null,null,null,null,null,null,null,null,"",null,null,"","",""]
[null,null,null,null,null,null,null,null,null,"",null,null,"","",""]
[null,null,null,null,null,null,null,null,null,"",null,null,"","",""]
[null,null,null,null,null,null,null,null,null,"",null,null,"","",""]
[null,null,null,null,null,null,null,null,null,"",null,null,"","",""]
[null,null,null,null,null,null,null,null,null,"",null,null,"","",""]
[null,null,null,null,null,null,null,null,null,"",null,null,"","",""]
[null,null,null,null,null,null,null,null,null,"",null,null,"","",""]
[null,null,null,null,null,null,null,null,null,"",null,null,"",{"$f":"IF(L196=\"Beholde\",D196,IF(L196=\"Fjerne\",\"-\",IF(OR(L196=\"Oppdatere\",L196=\"Legge til\",L196=\"Bake inn i annen faktor\"),D196,\"\")))","v":""},""]
[null,null,null,null,null,null,null,null,null,"",null,null,"","",""]
[null,null,null,null,null,null,null,null,null,"",null,null,"","",""]
[null,null,null,null,null,null,null,null,null,"",null,null,"","",""]
[null,null,null,null,null,null,null,null,null,"",null,null,"","",""]
[null,null,null,null,null,null,null,null,null,"",null,null,"","",""]
[null,null,null,null,null,null,null,null,null,"",null,null,"","",""]
[null,null,null,null,null,null,null,null,null,"",null,null,"","",""]
[null,null,null,null,null,null,null,null,null,"",null,null,"","",""]
[null,null,null,null,null,null,null,null,null,"",null,null,"","",""]
[null,null,null,null,null,null,null,null,null,"",null,null,"","",""]
[null,null,null,null,null,null,null,null,null,"",null,null,"","",""]
[null,null,null,null,null,null,null,null,null,"",null,null,"","",""]
[null,null,null,null,null,null,null,null,null,"",null,null,"","",""]
[null,null,null,null,null,null,null,null,null,"",null,null,"","",""]
[null,null,null,null,null,null,null,null,null,"",null,null,"","",""]
[null,null,null,null,null,null,null,null,null,"",null,null,"","",""]
[null,null,null,null,null,null,null,null,null,"",null,null,"","",""]
[null,null,null,null,null,null,null,null,null,"",null,null,"","",""]
[null,null,null,null,null,null,null,null,null,"",null,null,"","",""]
[null,null,null,null,null,null,null,null,null,{"$f":"IF(I216=\"IR\",\"-\",\"\")","v":""},null,null,{"$f":"IF(L216=\"Beholde\",C216,IF(L216=\"Fjerne\",\"-\",\"\"))","v":""},"",""]
[null,null,null,null,null,null,null,null,null,"",null,null,"","",{"$f":"IF(OR(L217=\"Fjerne\",L217=\"Bake inn i annen faktor\"),\"-\",\"\")","v":""}]
[null,null,null,null,null,null,null,null,null,"",null,null,"","",""]
[null,null,null,null,null,null,null,null,null,"",null,null,"","",""]
[null,null,null,null,null,null,null,null,null,"",null,null,"","",""]
[null,null,null,null,null,null,null,null,null,"",null,null,"","",""]
[null,null,null,null,null,null,null,null,null,"",null,null,"","",""]
[null,null,null,null,null,null,null,null,null,"",null,null,"","",""]
[null,null,null,null,null,null,null,null,null,"",null,null,"","",""]
[null,null,null,null,null,null,null,null,null,"",null,null,"","",""]
[null,null,null,null,null,null,null,null,null,"",null,null,"","",""]
[null,null,null,null,null,null,null,null,null,"",null,null,"","",""]
[null,null,null,null,null,null,null,null,null,"",null,null,"","",""]
[null,null,null,null,null,null,null,null,null,"",null,null,"","",""]
[null,null,null,null,null,null,null,null,null,"",null,null,"","",""]
[null,null,null,null,null,null,null,null,null,"",null,null,"","",""]
[null,null,null,null,null,null,null,null,null,"",null,null,"","",""]
[null,null,null,null,null,null,null,null,null,"",null,null,"","",""]
[null,null,null,null,null,null,null,null,null,"",null,null,"","",""]
[null,null,null,null,null,null,null,null,null,"",null,null,"","",""]
[null,null,null,null,null,null,null,null,null,"",null,null,"","",""]
[null,null,null,null,null,null,null,null,null,"",null,null,"","",""]
[null,null,null,null,null,null,null,null,null,"",null,null,"","",""]
[null,null,null,null,null,null,null,null,null,"",null,null,"","",""]
[null,null,null,null,null,null,null,null,null,"",null,null,"","",""]
[null,null,null,null,null,null,null,null,null,"",null,null,"","",""]
[null,null,null,null,null,null,null,null,null,"",null,null,"","",""]
[null,null,null,null,null,null,null,null,null,"",null,null,"","",""]
[null,null,null,null,null,null,null,null,null,"",null,null,"","",""]
[null,null,null,null,null,null,null,null,null,"",null,null,"","",""]
[null,null,null,null,null,null,null,null,null,"",null,null,"","",""]
[null,null,null,null,null,null,null,null,null,"",null,null,"","",""]
[null,null,null,null,null,null,null,null,null,"",null,null,"","",""]
[null,null,null,null,null,null,null,null,null,"",null,null,"","",""]
[null,null,null,null,null,null,null,null,null,"",null,null,"","",""]
[null,null,null,null,null,null,null,null,null,"",null,null,"","",""]
[null,null,null,null,null,null,null,null,null,"",null,null,"","",""]
[null,null,null,null,null,null,null,null,null,"",null,null,"","",""]
[null,null,null,null,null,null,null,null,null,"",null,null,"","",""]
[null,null,null,null,null,null,null,null,null,"",null,null,"","",""]
[null,null,null,null,null,null,null,null,null,"",null,null,"","",""]
[null,null,null,null,null,null,null,null,null,"",null,null,"","",""]
[null,null,null,null,null,null,null,null,null,"",null,null,"","",""]
[null,null,null,null,null,null,null,null,null,"",null,null,"","",""]
[null,null,null,null,null,null,null,null,null,"",null,null,"",{"$f":"IF(L260=\"Beholde\",D260,IF(L260=\"Fjerne\",\"-\",IF(OR(L260=\"Oppdatere\",L260=\"Legge til\",L260=\"Bake inn i annen faktor\"),D260,\"\")))","v":""},""]
[null,null,null,null,null,null,null,null,null,"",null,null,"","",""]
[null,null,null,null,null,null,null,null,null,"",null,null,"","",""]
[null,null,null,null,null,null,null,null,null,"",null,null,"","",""]
[null,null,null,null,null,null,null,null,null,"",null,null,"","",""]
[null,null,null,null,null,null,null,null,null,"",null,null,"","",""]
[null,null,null,null,null,null,null,null,null,"",null,null,"","",""]
[null,null,null,null,null,null,null,null,null,"",null,null,"","",""]
[null,null,null,null,null,null,null,null,null,"",null,null,"","",""]
[null,null,null,null,null,null,null,null,null,"",null,null,"","",""]
[null,null,null,null,null,null,null,null,null,"",null,null,"","",""]
[null,null,null,null,null,null,null,null,null,"",null,null,"","",""]
[null,null,null,null,null,null,null,null,null,"",null,null,"","",""]
[null,null,null,null,null,null,null,null,null,"",null,null,"","",""]
[null,null,null,null,null,null,null,null,null,"",null,null,"","",""]
[null,null,null,null,null,null,null,null,null,"",null,null,"","",""]
[null,null,null,null,null,null,null,null,null,"",null,null,"","",""]
[null,null,null,null,null,null,null,null,null,"",null,null,"","",""]
[null,null,null,null,null,null,null,null,null,"",null,null,"","",""]
[null,null,null,null,null,null,null,null,null,"",null,null,"","",""]
[null,null,null,null,null,null,null,null,null,{"$f":"IF(I280=\"IR\",\"-\",\"\")","v":""},null,null,{"$f":"IF(L280=\"Beholde\",C280,IF(L280=\"Fjerne\",\"-\",\"\"))","v":""},"",""]
[null,null,null,null,null,null,null,null,null,"",null,null,"","",{"$f":"IF(OR(L281=\"Fjerne\",L281=\"Bake inn i annen faktor\"),\"-\",\"\")","v":""}]
[null,null,null,null,null,null,null,null,null,"",null,null,"","",""]
[null,null,null,null,null,null,null,null,null,"",null,null,"","",""]
[null,null,null,null,null,null,null,null,null,"",null,null,"","",""]
[null,null,null,null,null,null,null,null,null,"",null,null,"","",""]
[null,null,null,null,null,null,null,null,null,"",null,null,"","",""]
[null,null,null,null,null,null,null,null,null,"",null,null,"","",""]
[null,null,null,null,null,null,null,null,null,"",null,null,"","",""]
[null,null,null,null,null,null,null,null,null,"",null,null,"","",""]
[null,null,null,null,null,null,null,null,null,"",null,null,"","",""]
[null,null,null,null,null,null,null,null,null,"",null,null,"","",""]
[null,null,null,null,null,null,null,null,null,"",null,null,"","",""]
[null,null,null,null,null,null,null,null,null,"",null,null,"","",""]
[null,null,null,null,null,null,null,null,null,"",null,null,"","",""]
[null,null,null,null,null,null,null,null,null,"",null,null,"","",""]
[null,null,null,null,null,null,null,null,null,"",null,null,"","",""]
[null,null,null,null,null,null,null,null,null,"",null,null,"","",""]
[null,null,null,null,null,null,null,null,null,"",null,null,"","",""]
[null,null,null,null,null,null,null,null,null,"",null,null,"","",""]
[null,null,null,null,null,null,null,null,null,"",null,null,"","",""]
[null,null,null,null,null,null,null,null,null,"",null,null,"","",""]
[null,null,null,null,null,null,null,null,null,"",null,null,"","",""]
[null,null,null,null,null,null,null,null,null,"",null,null,"","",""]
[null,null,null,null,null,null,null,null,null,"",null,null,"","",""]
[null,null,null,null,null,null,null,null,null,"",null,null,"","",""]
[null,null,null,null,null,null,null,null,null,"",null,null,"","",""]
[null,null,null,null,null,null,null,null,null,"",null,null,"","",""]
[null,null,null,null,null,null,null,null,null,"",null,null,"","",""]
[null,null,null,null,null,null,null,null,null,"",null,null,"","",""]
[null,null,null,null,null,null,null,null,null,"",null,null,"","",""]
[null,null,null,null,null,null,null,null,null,"",null,null,"","",""]
[null,null,null,null,null,null,null,null,null,"",null,null,"","",{"$f":"IF(L312=\"Fjerne\",\"-\",\"\")","v":""}]
[null,null,null,null,null,null,null,null,null,"",null,null,"","",""]
[null,null,null,null,null,null,null,null,null,"",null,null,"","",""]
[null,null,null,null,null,null,null,null,null,"",null,null,"","",""]
[null,null,null,null,null,null,null,null,null,"",null,null,"","",""]
[null,null,null,null,null,null,null,null,null,"",null,null,"","",""]
[null,null,null,null,null,null,null,null,null,"",null,null,"","",""]
[null,null,null,null,null,null,null,null,null,"",null,null,"","",""]
[null,null,null,null,null,null,null,null,null,"",null,null,"","",""]
[null,null,null,null,null,null,null,null,null,"",null,null,"","",""]
[null,null,null,null,null,null,null,null,null,"",null,null,"","",""]
[null,null,null,null,null,null,null,null,null,"",null,null,"","",""]
[null,null,null,null,null,null,null,null,null,"",null,null,"",{"$f":"IF(L324=\"Beholde\",D324,IF(L324=\"Fjerne\",\"-\",IF(OR(L324=\"Oppdatere\",L324=\"Legge til\",L324=\"Bake inn i annen faktor\"),D324,\"\")))","v":""},""]
[null,null,null,null,null,null,null,null,null,"",null,null,"","",""]
[null,null,null,null,null,null,null,null,null,"",null,null,"","",""]
[null,null,null,null,null,null,null,null,null,"",null,null,"","",""]
[null,null,null,null,null,null,null,null,null,"",null,null,"","",""]
[null,null,null,null,null,null,null,null,null,"",null,null,"","",""]
[null,null,null,null,null,null,null,null,null,"",null,null,"","",""]
[null,null,null,null,null,null,null,null,null,"",null,null,"",{"$f":"IF(L331=\"Beholde\",D331,IF(L331=\"Fjerne\",\"-\",\"\"))","v":""},""]
[null,null,null,null,null,null,null,null,null,"",null,null,"","",""]
[null,null,null,null,null,null,null,null,null,"",null,null,"","",""]
[null,null,null,null,null,null,null,null,null,"",null,null,"","",""]
[null,null,null,null,null,null,null,null,null,"",null,null,"","",""]
[null,null,null,null,null,null,null,null,null,"",null,null,"","",""]
[null,null,null,null,null,null,null,null,null,"",null,null,"","",""]
[null,null,null,null,null,null,null,null,null,"",null,null,"","",""]
[null,null,null,null,null,null,null,null,null,"",null,null,"","",""]
[null,null,null,null,null,null,null,null,null,"",null,null,"","",""]
[null,null,null,null,null,null,null,null,null,"",null,null,"","",""]
[null,null,null,null,null,null,null,null,null,"",null,null,"","",""]
[null,null,null,null,null,null,null,null,null,"",null,null,"","",""]
[null,null,null,null,null,null,null,null,null,{"$f":"IF(I344=\"IR\",\"-\",\"\")","v":""},null,null,{"$f":"IF(L344=\"Beholde\",C344,IF(L344=\"Fjerne\",\"-\",\"\"))","v":""},"",""]
[null,null,null,null,null,null,null,null,null,"",null,null,"","",""]
[null,null,null,null,null,null,null,null,null,"",null,null,"","",""]
[null,null,null,null,null,null,null,null,null,"",null,null,"","",""]
[null,null,null,null,null,null,null,null,null,"",null,null,"","",""]
[null,null,null,null,null,null,null,null,null,"",null,null,"","",""]
[null,null,null,null,null,null,null,null,null,"",null,null,"",null,""]
[null,null,null,null,null,null,null,null,null,"",null,null,"",null,""]
[null,null,null,null,null,null,null,null,null,"",null,null,"",null,""]
[null,null,null,null,null,null,null,null,null,"",null,null,"",null,""]
[null,null,null,null,null,null,null,null,null,"",null,null,"",null,""]
[null,null,null,null,null,null,null,null,null,null,null,null,"",null,""]
[null,null,null,null,null,null,null,null,null,null,null,null,"",null,""]
[null,null,null,null,null,null,null,null,null,null,null,null,"",null,""]
[null,null,null,null,null,null,null,null,null,null,null,null,"",null,""]
[null,null,null,null,null,null,null,null,null,null,null,null,"",null,""]
[null,null,null,null,null,null,null,null,null,null,null,null,"",null,""]
[null,null,null,null,null,null,null,null,null,null,null,null,"",null,""]
[null,null,null,null,null,null,null,null,null,null,null,null,"",null,""]
[null,null,null,null,null,null,null,null,null,null,null,null,"",null,""]
[null,null,null,null,null,null,null,null,null,null,null,null,"",null,""]
[null,null,null,null,null,null,null,null,null,null,null,null,"",null,""]
[null,null,null,null,null,null,null,null,null,null,null,null,"",null,""]
[null,null,null,null,null,null,null,null,null,null,null,null,"",null,""]
[null,null,null,null,null,null,null,null,null,null,null,null,"",null,""]
[null,null,null,null,null,null,null,null,null,null,null,null,"",null,""]
[null,null,null,null,null,null,null,null,null,null,null,null,"",null,""]
[null,null,null,null,null,null,null,null,null,null,null,null,"",null,""]
[null,null,null,null,null,null,null,null,null,null,null,null,"",null,""]
[null,null,null,null,null,null,null,null,null,null,null,null,"",null,""]
[null,null,null,null,null,null,null,null,null,null,null,null,"",null,""]
[null,null,null,null,null,null,null,null,null,null,null,null,"",null,""]
[null,null,null,null,null,null,null,null,null,null,null,null,"",null,{"$f":"IF(L376=\"Fjerne\",\"-\",\"\")","v":""}]
[null,null,null,null,null,null,null,null,null,null,null,null,"",null,""]
[null,null,null,null,null,null,null,null,null,null,null,null,"",null,""]
[null,null,null,null,null,null,null,null,null,null,null,null,"",null,""]
[null,null,null,null,null,null,null,null,null,null,null,null,"",null,""]
[null,null,null,null,null,null,null,null,null,null,null,null,"",null,""]
[null,null,null,null,null,null,null,null,null,null,null,null,""]
[null,null,null,null,null,null,null,null,null,null,null,null,""]
[null,null,null,null,null,null,null,null,null,null,null,null,""]
[null,null,null,null,null,null,null,null,null,null,null,null,""]
[null,null,null,null,null,null,null,null,null,null,null,null,""]
[null,null,null,null,null,null,null,null,null,null,null,null,""]
[null,null,null,null,null,null,null,null,null,null,null,null,""]
[null,null,null,null,null,null,null,null,null,null,null,null,""]

{"sheet":"Utslippsfaktorer arbeidsfane","index":22,"n_rows":42,"n_cols":10,"rows_kept":42,"cut":false,"hidden":true,"merged":[]}
[]
[null,"Materiale","Faktor fra dagens verktøy","Faktor fra samkjørings-\nprosjekt","Foreslått ny utslippsfaktor","Enhet","Klide 1","Kilde 2","Kilde3","Kommentar"]
[null,"Aluminium",9.18,9.18,{"$f":"((2.33+0.036)+(4+0.0553)+(5.71+0.0752))/3","v":4.0688333333333331},"kg CO2e/kg","Hydro 75R Aluminium Extrusion Ingot","Hydro 4.0 Aluminium Extrusion Ingot","Hydro Aluminium Extrusion Ingot Europe","Ny faktor: (A1-A4). \nGammel faktor: I dagens verktøy brukes 9,18 (fra samkjøringsprosjekt), hentet fra EFFEKT, igjen hentet fra EcoInvent; Primæraluminium (Ecoinvent), Europeisk teknologisk bransjesnitt, Nordisk el-mix 2012-2016 ved produksjon. Mye usikkerhet rundt denne. Sjekk EcoInvent"]
[null,"Armeringsstål",0.56399999999999995,"-",{"$f":"((0.577+0.000973)+(0.502+0.0357)+(0.698+0.0421))/3","v":0.618591},"kg CO2e/kg","Skanska Rebars - Baltic region","Skanska Rebars - Poland region 2","Skanska Rebars - Poland region 1","Gjennomsnitt av tre EPD'er på det norske markedet; NEPD-2084-939-EN (A1-A4), NEPD-2083-939-EN (A1-A4) og NEPD-2082-939-EN (A1-A4)"]
[null,"Asfaltbetong (Agb)",6.6900000000000001E-2,6.6900000000000001E-2,{"$f":"(22.2+8.55+20.4)/1000","v":5.1150000000000001E-2},"kg CO2e/kg","EBA Agb 11. Asfalt (slitelag)",null,null,"NEPD-1390-456-NO (A1-A3). Bransjegjennomsnitt, EPD utarbeidet av EBA (Entreprenørforeningen Bygg og Anlegg) v/Lemminkainen Norge AS, Skanska Asfalt AS, Peab Asfalt AS, NCC Industry og Veidekke Industri AS"]
[null,"Skjelettasfalt (Ska)",null,null,6.5699999999999995E-2,null,"EBA Ska 11",null,null,"NEPD-1391-456-NO (A1-A3). Bransjegjennomsnitt, EPD utarbeidet av EBA (Entreprenørforeningen Bygg og Anlegg) v/Lemminkainen Norge AS, Skanska Asfalt AS, Peab Asfalt AS, NCC Industry og Veidekke Industri AS"]
[null,"Asfaltert grus (Ag)",5.8400000000000001E-2,5.8400000000000001E-2,{"$f":"(18.5+9.86+20.4)/1000","v":4.8759999999999998E-2},"kg CO2e/kg","EBA Ag 16. Asfalt (bærelag)",null,null,"NEPD-1489-456-NO (A1-A3). Bransjegjennomsnitt, EPD utarbeidet av EBA (Entreprenørforeningen Bygg og Anlegg) v/Lemminkainen Norge AS, Skanska Asfalt AS, Peab Asfalt AS, NCC Industry og Veidekke Industri AS"]
[null,"Betong",350,350,330,"kg CO2e/m3",null,null,null,"Gammel faktor: NB 37 fra norsk betongforening. Bransjestandard for lavkarbon type C - B35 - M40.\nNy faktor: NB 37 (2019). Bransjereferanse for B35."]
[null,"Betong",null,null,{"$f":"E8/2400","v":0.13750000000000001},"kg CO2e/kg",null,null,null,"Ny faktor: NB 37 sier at ved omgjøring fra kg/m3 til kg/kg skal densiteten 2400 kg/m3 brukes."]
[null,"Lyktestolper (stål)",1.72,"-","-",null,null,null,null,"Identisk med \"stål m/resirk\". Foreslår at denne utgår"]
[null,"Fuktisolasjon (bitumenemulsjon)"]
[null,"Naturstein",null,null,null,null,null,null,null,"Foreslår at denne utgår. Hør med Kjell?"]
[null,"PE-skum",3.23,3.23,null,"kg CO2e/kg",null,null,null,"Mangler dokumentasjon. Har kun tall fra EFFEKT"]
[null,"Salt",0.17899999999999999,0.17899999999999999,0.17899999999999999,"kg CO2e/kg",null,null,null,"Hentet fra EcoInvent; \"Sodium chloride, powder {RER} | production | Conseq, U\""]
[null,"Sand",2.49E-3,2.49E-3,"-","kg CO2e/kg",null,null,null,"Hva skal denne brukes til? Foreslår at den utgår"]
[null,"Sprøytebetong",0.2482,"-",{"$f":"0.21+0.0073+0.0309+0.00423","v":0.25242999999999999},null,"Weber sprøytebetong V, dry sprayable mortar",null,null,"NEPD-1509-512-EN (A1-A4)."]
[null,"Støttevegger og forankringer (stål)",2.97,"-","-","kg CO2e/kg",null,null,null,"Identisk med \"stål u/resirk\". Foreslår at denne utgår"]
[null,"Stål m/resirk",1.72,1.72,null,null,null,null,null,"Gammel faktor: snitt fra 6 norske EPD'er. Uklart hvilke. Foreslår at denne fjernes"]
[null,"Stål u/resirk",2.97,"-",{"$f":"((1.04+0.0259)+(2.78+0.0259)+((2399+29.9+62.6+7.26)/1000))/3","v":2.1235200000000001},"kg CO2e/kg","Metacon H-I-U-L-T-profiler","Metacon kaldformede hulprofiler","Contiga Prefabricerade stålkonstruktioner","Gjennomsnitt av tre EPD'er på det norske markedet; NEPD-1914-839-EN (A1-A4), NEPD-1915-839-EN (A1-A4) og NEPD-1928-851-SE (A1-A4)"]
[null,"Trevirke",4,"-","-",null,null,null,null,"Gammel faktor: refererer til samkjøringsprosjekt, men finner ikke dette noe sted. \nForeslår at denne utgår."]
[null,"XPS",{"$f":"112/25","v":4.4800000000000004},"-",null,"kg CO2e/kg",null,null,null,"Gammel faktor: benytter samme EPD som \"ny\", men sier 25 kg/m3 for å finne kg CO2e/kg. Hvor kommer dette fra?"]
[null,"XPS",3.7,null,{"$f":"(3.7+0.011)","v":3.7110000000000003},"kg CO2e/m2","Brødr. Sunde AS Sundolitt XPS",null,null,"NEPD-396-274-NO (A1-A4). Sundolitt, Brødrene Sunde AS. 33mm tykkelse"]
[null,"XPS/betongelement til tunnel",0.18,"-","-","kg CO2e/kg",null,null,null,"Gammel faktor: \nEstimert egenvekt: ((150 * 2400) + (50 * 25)) / 200 = 1800 kg CO2e/m3. Hvor kommer egenvekt XPS fra?\nEstimert utslippsfaktor: (62,7+1,01+2,38+0,725)/0,2/1800\nBasert på samme EPD som ny"]
[null,"XPS/betongelement til tunnel","-","-",{"$f":"(62.7+1.01+2.38+0.725)","v":66.814999999999998},"kg CO2e/m2","Ølen betong AS Element for samferdelstunneler",null,null,"NEPD-351-243-NO (A1-A4). Elementene består av 150mm betong og 50mm XPS kpa isolasjon, til sammen 200mm tykkelse."]
[null,"Topeka",null,null,0.184,null,null,null,null,"Antatt likt som støpeasfalt; 'Mastic asphalt' hentet fra Ecoinvent v3 med nordisk el-mix 2012-2016 i produksjon. Som VegLCA."]
[]
[null,"Energi"]
[null,"Biodiesel WTT",0.62,0.62,1.92,null,null,null,null,"NS-EN 16258:2012. Tabell A.1 Biodiesel \"well to tank\""]
[null,"Diesel forbrenning",2.67,null,2.67,"kg CO2e/liter",null,null,null,"NS-EN 16258:2012. Tabell A.1 Diesel \"tank to wheel\""]
[null,"Diesel WTW",3.1,3.19,3.24,"kg CO2e/liter",null,null,null,"NS-EN 16258-2012. Tabell A.1 Diesel \"well to wheel\""]
[null,"Elektrisitet anleggsfase (Europeisk miks)",null,null,null,"kg CO2e/kWh"]
[null,"Elektrisitet anleggsfase (Norsk miks)",2.6381428571428601E-2,null,2.6380000000000001E-2,"kg CO2e/kWh",null,null,null,"NS 3720:2018. Utslipp for år 2020 er estimert med utgangspunkt i utslipp for 2015 der det antas at den årlige reduksjonen er lineær frem mot 2050."]
[null,"Elektrisitet drift 20 år (Europeisk miks)",null,null,null,"kg CO2e/kWh"]
[null,"Elektrisitet drift 20 år (Norsk miks)",0.18290000000000001,null,1.7999999999999999E-2,"kg CO2e/kWh",null,null,null,"Ny faktor: NS3720"]
[null,"Elektrisitet drift 40 år (Europeisk miks)",0.14460000000000001,null,0.13600000000000001,"kg CO2e/kWh",null,null,null,"Ny faktor: NS3720"]
[null,"Elektrisitet drift 40 år (Norsk miks)",null,null,null,"kg CO2e/kWh"]
[null,"Elektrisitet drift 55 år (Europeisk miks",null,null,0.13600000000000001,null,null,null,null,"NS 3720:2018. Estimerte utslipp i år 2075."]
[null,"Sprengstoff CTG",2.64,"-",{"$f":"2.65+0.028","v":2.6779999999999999},"kg CO2e/kg tovex","Orica, Bulk emulsion explosives",null,null,"NEPD-1591-615-EN (A1-A4)."]
[null,"Sprengstoff detonering",0.152,null,{"$f":"0.152","v":0.152},"kg CO2e/kg tovex",null,null,null,"NEPD-1591-615-EN (A5-2)."]
[]
[null,"Annet"]
[null,"Trafikkmiks 2015"]

{"sheet":"Revisjonslogg","index":23,"n_rows":5,"n_cols":4,"rows_kept":5,"cut":false,"hidden":false,"merged":[]}
["Revisjon","Dato avlevert","Endringer","Ansvarlig(e) "]
["2.0 (beta)","2020-05-04","Oppdatering av samtlige faktorer, beregninger og layout. Oppdateringen er gjort med utgangspunkt i at verktøyet skal bli mer brukervennlig og mer korrekt. Dette innebærer at alle faner er omstrukturert for økt forståelighet, beregninger er kvalitetssikret og i noen tilfeller rettet/endret, utslipps- og beregningsfaktorer er oppdatert og dokumentert. Figurer er oppdatert og noen er fjernet/lagt til. ","Julie Gade Gørbitz (jugg@niras.com) og Ragnhild Stamer Ekerholt (raek@niras.com) "]
["2.0","2020-06-01","Oppdatert figurformattering, rettet feil i formler.","Julie Gade Gørbitz (jugg@niras.com) og Ragnhild Stamer Ekerholt (raek@niras.com) "]
["2.1","2020-09-02","Rettet feil knyttet til viftedrift i enkeltløpstunneler.","Julie Gade Gørbitz (jugg@niras.com) og Ragnhild Stamer Ekerholt (raek@niras.com) "]
["2.2","2020-09-21","Rettet feil som gjorde at beregningene ble gjort som om sideveier alltid var belyst, også om det vart gjort valg om at de ikke skulle være det.","Julie Gade Gørbitz (jugg@niras.com) og Ragnhild Stamer Ekerholt (raek@niras.com) "]

{"sheet":"Revisjonslogg_intern","index":24,"n_rows":31,"n_cols":4,"rows_kept":31,"cut":false,"hidden":true,"merged":[[17,0,17,2],[18,0,18,2]]}
["Revisjon","Dato avlevert","Endringer","Ansvarlig(e) "]
["2.0","2020-05-04","Oppdatering av samtlige faktorer, beregninger og layout. Oppdateringen er gjort med utgangspunkt i at verktøyet skal bli mer brukervennlig og mer korrekt. Dette innebærer at alle faner er omstrukturert for økt forståelighet, beregninger er kvalitetssikret og i noen tilfeller rettet/endret, utslipps- og beregningsfaktorer er oppdatert og dokumentert. Figurer er oppdatert og noen er fjernet/lagt til. ","JUGG, RAEK"]
["2.0","2020-05-29","Belysning sidevei - legge inn valg om det separat fra hovedvei","JUGG, RAEK"]
[]
[]
[]
[]
[]
[]
[]
[]
[]
[]
[]
[]
[]
[]
["Forslag til senere revisjoner"]
["Legge til utslippsfaktor for pukk og mulighet til å skille mellom eksternt og internt produsert pukk. Nå antas det implisitt at all pukk til forsterknings- og frostsikringslag kommer fra linja",null,null,"JUGG"]
["Oppdatere produksjon av stein til frostsikrings- og forsterkningslag - hva må gjennom grovknuser og finknuser ",null,null,"JUGG"]
["Legget til faktorer for legging av forsterknings- og frostsikringslag",null,null,"JUGG"]
["Legge inn figurer sensitivitetsanalyse",null,null,"JUGG"]
["Legge inn tabell med tilhørende figur som gjør det mulig å skille mellom driftsutslipp fra hhv. vei i dagen, tunnel og bru",null,null,"JUGG"]
["Legge inn prosesskoder jf. ønske fra Heather Mason i Rambøll",null,null,"JUGG"]
["Flytte bredde anleggbelte, veibredder, brubredder (m.m?) til beregningsfaktorfane, slik at inndatatabellen henter automatisk fra beregnignsfktorfane",null,null,"RAEK"]
["Legge inn et ekstra element i nedtrekksmeny \"annen betong\". For å gjøre det enklere å utvide tunnelportaler o.l.",null,null,"RAEK"]
["Legge inn celle i inndatafane \"vei i eksisterende trasé\" (eller lignende) slik at areal til beregning av arealbruksendringer ikke teller med vei i eks. trasé",null,null,"RAEK"]
["I veiledningsfane: legge til dato levert/utarbeidet, så det er lett å tracke linken mellom rapport og regneark",null,null,"RAEK"]
["Gjøre det mulig å legge inn flere enkelt/dobbeltløpstunneler med ulik tunnelprofil",null,null,"RAEK"]
["Legge til enda en EPD på armeringsstål som ikke er basert på 100 % resirkulert stål",null,null,"JUGG"]
["Fjerne A4 fra utslippsfaktorer for stål og armeringsstål ",null,null,"JUGG"]